RESNUM,RESNAME,H_X,H_Y,H_BEST_REF_SCORE,H_BEST_REF_COV,H_BEST_REF_MATCH,H_UCBShift,HA_X,HA_Y,HA_BEST_REF_SCORE,HA_BEST_REF_COV,HA_BEST_REF_MATCH,HA_UCBShift,C_X,C_Y,C_BEST_REF_SCORE,C_BEST_REF_COV,C_BEST_REF_MATCH,C_UCBShift,CA_X,CA_Y,CA_BEST_REF_SCORE,CA_BEST_REF_COV,CA_BEST_REF_MATCH,CA_UCBShift,CB_X,CB_Y,CB_BEST_REF_SCORE,CB_BEST_REF_COV,CB_BEST_REF_MATCH,CB_UCBShift,N_X,N_Y,N_BEST_REF_SCORE,N_BEST_REF_COV,N_BEST_REF_MATCH,N_UCBShift
1,MET,8.320041955278054,,0,0,0,8.320041955278054,4.347008701309801,,0,0,0,4.347008701309801,175.5425480903874,,0,0,0,175.5425480903874,55.32323385900766,,0,0,0,55.32323385900766,32.524361255305806,,0,0,0,32.524361255305806,121.00570114572093,,0,0,0,121.00570114572093
2,GLY,8.19054592097347,,0,0,0,8.19054592097347,3.9038097290986786,,0,0,0,3.9038097290986786,173.91143926474638,,0,0,0,173.91143926474638,45.38278980229215,,0,0,0,45.38278980229215,,,0,0,0,,111.07822170253635,,0,0,0,111.07822170253635
3,HIS,8.362304133227884,,0,0,0,8.362304133227884,4.476253853740703,,0,0,0,4.476253853740703,174.55264881456876,,0,0,0,174.55264881456876,55.769804660417364,,0,0,0,55.769804660417364,28.77321909938395,,0,0,0,28.77321909938395,119.50551659411144,,0,0,0,119.50551659411144
4,HIS,8.40402289046509,,0,0,0,8.40402289046509,4.394633772677323,,0,0,0,4.394633772677323,175.1578313993007,,0,0,0,175.1578313993007,56.271329853424355,,0,0,0,56.271329853424355,28.8097908996004,,0,0,0,28.8097908996004,121.40035791843157,,0,0,0,121.40035791843157
5,HIS,8.383739552403153,,0,0,0,8.383739552403153,4.331312382084582,,0,0,0,4.331312382084582,174.71130137755023,,0,0,0,174.71130137755023,56.537785364435564,,0,0,0,56.537785364435564,28.746680563947166,,0,0,0,28.746680563947166,122.34119762237208,,0,0,0,122.34119762237208
6,HIS,8.347982714124765,,0,0,0,8.347982714124765,4.455682733499834,,0,0,0,4.455682733499834,174.63971179502164,,0,0,0,174.63971179502164,55.46165053735709,,0,0,0,55.46165053735709,28.47237687797758,,0,0,0,28.47237687797758,121.51692504816295,,0,0,0,121.51692504816295
7,HIS,8.318238424264624,,0,0,0,8.318238424264624,4.3992401999667,,0,0,0,4.3992401999667,174.64765224785214,,0,0,0,174.64765224785214,55.65431917110667,,0,0,0,55.65431917110667,28.56425829769675,,0,0,0,28.56425829769675,121.16983506512376,,0,0,0,121.16983506512376
8,HIS,8.198140921756021,,0,0,0,8.198140921756021,4.394416288161838,,0,0,0,4.394416288161838,174.57319805508936,,0,0,0,174.57319805508936,56.15594139853479,,0,0,0,56.15594139853479,29.013782003934953,,0,0,0,29.013782003934953,121.17699297680653,,0,0,0,121.17699297680653
9,LEU,8.048789401270952,,0,0,0,8.048789401270952,4.086754019266844,,0,0,0,4.086754019266844,176.8542885525197,,0,0,0,176.8542885525197,55.033070524897326,,0,0,0,55.033070524897326,41.6964321010101,,0,0,0,41.6964321010101,125.76350104715284,,0,0,0,125.76350104715284
10,GLU,8.203341016966368,,0,0,0,8.203341016966368,4.171033497857698,,0,0,0,4.171033497857698,176.46572714629815,,0,0,0,176.46572714629815,56.3523203007881,,0,0,0,56.3523203007881,29.72829697115107,,0,0,0,29.72829697115107,123.68355856476856,,0,0,0,123.68355856476856
11,ALA,8.471020631945832,,0,0,0,8.471020631945832,4.176916848068598,,0,0,0,4.176916848068598,177.17885561488512,,0,0,0,177.17885561488512,52.212111984232436,,0,0,0,52.212111984232436,18.34466211817627,,0,0,0,18.34466211817627,127.6795052073149,,0,0,0,127.6795052073149
12,GLU,8.063191287551337,,0,0,0,8.063191287551337,4.221016767959817,,0,0,0,4.221016767959817,176.66577288749028,,0,0,0,176.66577288749028,56.5220405476912,,0,0,0,56.5220405476912,29.865534538628037,,0,0,0,29.865534538628037,121.72946123772338,,0,0,0,121.72946123772338
13,VAL,8.407268656587856,,0,0,0,8.407268656587856,4.017024589177489,,0,0,0,4.017024589177489,176.16043551405264,,0,0,0,176.16043551405264,62.40573106130536,,0,0,0,62.40573106130536,32.109993341491844,,0,0,0,32.109993341491844,123.66585044726385,,0,0,0,123.66585044726385
14,HIS,8.343613593634144,,0,0,0,8.343613593634144,4.7163022803474295,,0,0,0,4.7163022803474295,174.78597048755134,,0,0,0,174.78597048755134,55.69894132141747,,0,0,0,55.69894132141747,30.380578533472082,,0,0,0,30.380578533472082,122.35273905850816,,0,0,0,122.35273905850816
15,ASN,8.619384267177267,,0,0,0,8.619384267177267,4.627628047691198,,0,0,0,4.627628047691198,174.604069777195,,0,0,0,174.604069777195,53.84726537283827,,0,0,0,53.84726537283827,39.216800192718395,,0,0,0,39.216800192718395,122.21290922867688,,0,0,0,122.21290922867688
16,GLN,8.503873922915973,,0,0,0,8.503873922915973,4.818540542390942,,0,0,0,4.818540542390942,175.33207619644799,,0,0,0,175.33207619644799,55.42733970513931,,0,0,0,55.42733970513931,30.475697123088022,,0,0,0,30.475697123088022,122.9139628589688,,0,0,0,122.9139628589688
17,LEU,9.154122123454323,,0,0,0,9.154122123454323,4.717764108302808,,0,0,0,4.717764108302808,175.7934464557276,,0,0,0,175.7934464557276,53.452920983805086,,0,0,0,53.452920983805086,44.21373641937507,,0,0,0,44.21373641937507,125.03157885786435,,0,0,0,125.03157885786435
18,GLU,8.893947486247086,,0,0,0,8.893947486247086,4.701006424886224,,0,0,0,4.701006424886224,175.57922691295371,,0,0,0,175.57922691295371,56.46765652394272,,0,0,0,56.46765652394272,29.719654035680986,,0,0,0,29.719654035680986,124.1295700996004,,0,0,0,124.1295700996004
19,ILE,9.195273083150184,,0,0,0,9.195273083150184,4.826714562814963,,0,0,0,4.826714562814963,175.12666872748363,,0,0,0,175.12666872748363,60.16786401953047,,0,0,0,60.16786401953047,40.16649976227661,,0,0,0,40.16649976227661,126.01753768305029,,0,0,0,126.01753768305029
20,LYS,8.874721093739593,,0,0,0,8.874721093739593,4.81737501966367,,0,0,0,4.81737501966367,174.52587579334553,,0,0,0,174.52587579334553,54.896091762004666,,0,0,0,54.896091762004666,35.37998093487069,,0,0,0,35.37998093487069,126.6855925922966,,0,0,0,126.6855925922966
21,PHE,9.317861578898881,,0,0,0,9.317861578898881,5.397737342329892,,0,0,0,5.397737342329892,174.98408075904098,,0,0,0,174.98408075904098,55.87448970769231,,0,0,0,55.87448970769231,40.10694271690532,,0,0,0,40.10694271690532,123.40972224723609,,0,0,0,123.40972224723609
22,ARG,9.134954151720502,,0,0,0,9.134954151720502,5.0690698212620715,,0,0,0,5.0690698212620715,176.11994940879123,,0,0,0,176.11994940879123,55.169556094022646,,0,0,0,55.169556094022646,32.403310951320904,,0,0,0,32.403310951320904,124.81573333928293,,0,0,0,124.81573333928293
23,LEU,9.16505501043401,,0,0,0,9.16505501043401,4.853238380497281,,0,0,0,4.853238380497281,179.38777528562548,,0,0,0,179.38777528562548,54.70690921934177,,0,0,0,54.70690921934177,42.291816323709625,,0,0,0,42.291816323709625,128.52922751900323,,0,0,0,128.52922751900323
24,THR,8.567292798418249,,0,0,0,8.567292798418249,4.120955562765014,,0,0,0,4.120955562765014,174.88538220051058,,0,0,0,174.88538220051058,64.7900547007215,,0,0,0,64.7900547007215,69.28180251389166,,0,0,0,69.28180251389166,113.85947216042845,,0,0,0,113.85947216042845
25,ASP,7.933456779381729,,0,0,0,7.933456779381729,4.584820297133422,,0,0,0,4.584820297133422,176.8781082836053,,0,0,0,176.8781082836053,53.30544822332668,,0,0,0,53.30544822332668,40.020693962592965,,0,0,0,40.020693962592965,118.87814478770119,,0,0,0,118.87814478770119
26,GLY,8.110146356460206,,0,0,0,8.110146356460206,4.001811973462648,,0,0,0,4.001811973462648,174.54202183427128,,0,0,0,174.54202183427128,45.15828346329781,,0,0,0,45.15828346329781,,,0,0,0,,108.73894515369075,,0,0,0,108.73894515369075
27,SER,7.923730236147187,,0,0,0,7.923730236147187,4.4091427007881006,,0,0,0,4.4091427007881006,172.473720657437,,0,0,0,172.473720657437,59.407861038328335,,0,0,0,59.407861038328335,64.54682537225553,,0,0,0,64.54682537225553,117.12022649057054,,0,0,0,117.12022649057054
28,ASP,8.529364374980574,,0,0,0,8.529364374980574,5.554181123165723,,0,0,0,5.554181123165723,175.68625730217008,,0,0,0,175.68625730217008,53.047139044228,,0,0,0,53.047139044228,43.58416025786991,,0,0,0,43.58416025786991,121.20728496924187,,0,0,0,121.20728496924187
29,ILE,9.037520427289378,,0,0,0,9.037520427289378,4.54207426949162,,0,0,0,4.54207426949162,175.29003727065157,,0,0,0,175.29003727065157,60.56759916815407,,0,0,0,60.56759916815407,39.82300938252303,,0,0,0,39.82300938252303,122.87182175328006,,0,0,0,122.87182175328006
30,GLY,8.675091822066824,,0,0,0,8.675091822066824,4.206892042127317,,0,0,0,4.206892042127317,173.0729050535076,,0,0,0,173.0729050535076,44.05898064134754,,0,0,0,44.05898064134754,,,0,0,0,,114.69577639140859,,0,0,0,114.69577639140859
31,PRO,,,0,0,0,,4.533506455988457,,0,0,0,4.533506455988457,176.34853680395716,,0,0,0,176.34853680395716,62.78086528074148,,0,0,0,62.78086528074148,33.28185241913642,,0,0,0,33.28185241913642,,,0,0,0,
32,LYS,8.817191264008214,,0,0,0,8.817191264008214,4.582453850693751,,0,0,0,4.582453850693751,174.95068336428017,,0,0,0,174.95068336428017,54.338199571250975,,0,0,0,54.338199571250975,35.716791345626596,,0,0,0,35.716791345626596,122.30785456417472,,0,0,0,122.30785456417472
33,ALA,8.434061922194472,,0,0,0,8.434061922194472,4.619904198529249,,0,0,0,4.619904198529249,176.77326444193585,,0,0,0,176.77326444193585,51.33370395111,,0,0,0,51.33370395111,18.95080597833278,,0,0,0,18.95080597833278,126.67169181307027,,0,0,0,126.67169181307027
34,PHE,8.996686258197359,,0,0,0,8.996686258197359,5.224009615306916,,0,0,0,5.224009615306916,173.58711511950827,,0,0,0,173.58711511950827,54.47739643321123,,0,0,0,54.47739643321123,41.435084855455656,,0,0,0,41.435084855455656,122.46874796432458,,0,0,0,122.46874796432458
35,PRO,,,0,0,0,,4.565241256759907,,0,0,0,4.565241256759907,177.1921827268898,,0,0,0,177.1921827268898,62.87464817431457,,0,0,0,62.87464817431457,32.608351091691645,,0,0,0,32.608351091691645,,,0,0,0,
36,ASP,8.537150483644133,,0,0,0,8.537150483644133,4.268643646950272,,0,0,0,4.268643646950272,176.8917278398657,,0,0,0,176.8917278398657,56.73968130054391,,0,0,0,56.73968130054391,40.110755621944726,,0,0,0,40.110755621944726,122.22969332805528,,0,0,0,122.22969332805528
37,ALA,7.884067665700966,,0,0,0,7.884067665700966,4.2330105939116445,,0,0,0,4.2330105939116445,178.20928060527805,,0,0,0,178.20928060527805,52.75337007324897,,0,0,0,52.75337007324897,18.863872322272176,,0,0,0,18.863872322272176,119.79257281777667,,0,0,0,119.79257281777667
38,THR,7.684147671395272,,0,0,0,7.684147671395272,4.178928487698412,,0,0,0,4.178928487698412,174.35782539364524,,0,0,0,174.35782539364524,64.84850451019535,,0,0,0,64.84850451019535,69.46832031360861,,0,0,0,69.46832031360861,116.79206891661117,,0,0,0,116.79206891661117
39,THR,8.487161613919413,,0,0,0,8.487161613919413,4.8047346848706844,,0,0,0,4.8047346848706844,176.23149271336442,,0,0,0,176.23149271336442,60.609091701465196,,0,0,0,60.609091701465196,71.07468599330669,,0,0,0,71.07468599330669,118.39120553211234,,0,0,0,118.39120553211234
40,VAL,9.429584603130202,,0,0,0,9.429584603130202,3.5618163585497835,,0,0,0,3.5618163585497835,177.65154344410035,,0,0,0,177.65154344410035,66.73357351134422,,0,0,0,66.73357351134422,31.38553427949828,,0,0,0,31.38553427949828,122.73359395823621,,0,0,0,122.73359395823621
41,SER,8.229061225074926,,0,0,0,8.229061225074926,4.040224573437674,,0,0,0,4.040224573437674,176.73889677607946,,0,0,0,176.73889677607946,61.56838948478188,,0,0,0,61.56838948478188,62.20737007644023,,0,0,0,62.20737007644023,115.15514714235209,,0,0,0,115.15514714235209
42,ALA,7.874232656771007,,0,0,0,7.874232656771007,4.14719182950938,,0,0,0,4.14719182950938,180.4250435998779,,0,0,0,180.4250435998779,54.722919371606174,,0,0,0,54.722919371606174,18.40600847969808,,0,0,0,18.40600847969808,124.57248725022755,,0,0,0,124.57248725022755
43,LEU,8.512206442768342,,0,0,0,8.512206442768342,3.6840710646076142,,0,0,0,3.6840710646076142,179.18543938925518,,0,0,0,179.18543938925518,57.867673274453324,,0,0,0,57.867673274453324,41.812704496003995,,0,0,0,41.812704496003995,120.86283597315462,,0,0,0,120.86283597315462
44,LYS,8.321375983449883,,0,0,0,8.321375983449883,3.6179148638999887,,0,0,0,3.6179148638999887,178.67376825158175,,0,0,0,178.67376825158175,61.287155077306025,,0,0,0,61.287155077306025,32.44181397042957,,0,0,0,32.44181397042957,118.68708863894994,,0,0,0,118.68708863894994
45,GLU,8.417839645182594,,0,0,0,8.417839645182594,3.982022993564768,,0,0,0,3.982022993564768,179.15519485211453,,0,0,0,179.15519485211453,59.43512180964591,,0,0,0,59.43512180964591,29.18842524121434,,0,0,0,29.18842524121434,119.36891743029749,,0,0,0,119.36891743029749
46,THR,8.088153323154623,,0,0,0,8.088153323154623,4.085883347741148,,0,0,0,4.085883347741148,176.92624318200131,,0,0,0,176.92624318200131,66.97952303585858,,0,0,0,66.97952303585858,68.26692257352647,,0,0,0,68.26692257352647,118.34214061742146,,0,0,0,118.34214061742146
47,VAL,8.118492825430124,,0,0,0,8.118492825430124,3.347839393192918,,0,0,0,3.347839393192918,178.12804995261962,,0,0,0,178.12804995261962,67.1678919103452,,0,0,0,67.1678919103452,31.30679297966478,,0,0,0,31.30679297966478,122.41163605432901,,0,0,0,122.41163605432901
48,ILE,8.079045473498724,,0,0,0,8.079045473498724,3.4990391155566645,,0,0,0,3.4990391155566645,178.8899400088023,,0,0,0,178.8899400088023,65.0414286498113,,0,0,0,65.0414286498113,38.12859040396825,,0,0,0,38.12859040396825,119.84857076961373,,0,0,0,119.84857076961373
49,SER,8.24856412007437,,0,0,0,8.24856412007437,4.371128618326118,,0,0,0,4.371128618326118,176.49085943475413,,0,0,0,176.49085943475413,61.12484285169275,,0,0,0,61.12484285169275,63.10200416360861,,0,0,0,63.10200416360861,116.14334717515818,,0,0,0,116.14334717515818
50,GLU,8.14916480998446,,0,0,0,8.14916480998446,4.2798184556166055,,0,0,0,4.2798184556166055,176.26190053742368,,0,0,0,176.26190053742368,56.391652605505605,,0,0,0,56.391652605505605,29.351601748923297,,0,0,0,29.351601748923297,120.07144681068377,,0,0,0,120.07144681068377
51,TRP,7.245740644533244,,0,0,0,7.245740644533244,4.654394055397381,,0,0,0,4.654394055397381,175.00923884596514,,0,0,0,175.00923884596514,56.942710122927075,,0,0,0,56.942710122927075,29.457691175019423,,0,0,0,29.457691175019423,124.60870961956932,,0,0,0,124.60870961956932
52,PRO,,,0,0,0,,4.379626154939505,,0,0,0,4.379626154939505,177.644005115762,,0,0,0,177.644005115762,62.402647465778664,,0,0,0,62.402647465778664,32.066922082944835,,0,0,0,32.066922082944835,,,0,0,0,
53,ARG,8.762457342257743,,0,0,0,8.762457342257743,4.134271703385503,,0,0,0,4.134271703385503,176.854472829132,,0,0,0,176.854472829132,58.37850837552447,,0,0,0,58.37850837552447,30.03359048036408,,0,0,0,30.03359048036408,124.12384044880675,,0,0,0,124.12384044880675
54,GLU,8.57608055932956,,0,0,0,8.57608055932956,4.180632322721723,,0,0,0,4.180632322721723,176.96132905476745,,0,0,0,176.96132905476745,57.34407833002553,,0,0,0,57.34407833002553,29.59431585111555,,0,0,0,29.59431585111555,118.0204608074703,,0,0,0,118.0204608074703
55,LYS,7.838785920041069,,0,0,0,7.838785920041069,4.392595943578644,,0,0,0,4.392595943578644,176.58642356936952,,0,0,0,176.58642356936952,54.83486790839161,,0,0,0,54.83486790839161,31.741442584337886,,0,0,0,31.741442584337886,120.46060527593518,,0,0,0,120.46060527593518
56,GLU,8.492163606210456,,0,0,0,8.492163606210456,4.1148764356116105,,0,0,0,4.1148764356116105,176.6173456394883,,0,0,0,176.6173456394883,58.21408397484738,,0,0,0,58.21408397484738,29.543735195382396,,0,0,0,29.543735195382396,122.317165898335,,0,0,0,122.317165898335
57,ASN,8.266468413197913,,0,0,0,8.266468413197913,4.765202891680542,,0,0,0,4.765202891680542,175.31900060383504,,0,0,0,175.31900060383504,53.03425315034965,,0,0,0,53.03425315034965,38.312656273548676,,0,0,0,38.312656273548676,116.054063294561,,0,0,0,116.054063294561
58,GLY,7.693098353785104,,0,0,0,7.693098353785104,3.2054418919358425,,0,0,0,3.2054418919358425,172.7113608867799,,0,0,0,172.7113608867799,44.27793922282717,,0,0,0,44.27793922282717,,,0,0,0,,108.14769710349096,,0,0,0,108.14769710349096
59,PRO,,,0,0,0,,4.16153230438173,,0,0,0,4.16153230438173,175.71237339119216,,0,0,0,175.71237339119216,62.697178334743036,,0,0,0,62.697178334743036,31.712062392218893,,0,0,0,31.712062392218893,,,0,0,0,
60,LYS,8.496070824264624,,0,0,0,8.496070824264624,4.22314965991231,,0,0,0,4.22314965991231,176.9988933136863,,0,0,0,176.9988933136863,56.913541971345325,,0,0,0,56.913541971345325,33.259451082772785,,0,0,0,33.259451082772785,119.4557679430181,,0,0,0,119.4557679430181
61,THR,8.199330074913975,,0,0,0,8.199330074913975,4.633853227439228,,0,0,0,4.633853227439228,175.2945155106227,,0,0,0,175.2945155106227,59.90195238655233,,0,0,0,59.90195238655233,71.74452531196582,,0,0,0,71.74452531196582,110.87315994187479,,0,0,0,110.87315994187479
62,VAL,8.524986622838272,,0,0,0,8.524986622838272,3.8547474696608943,,0,0,0,3.8547474696608943,176.43625678778446,,0,0,0,176.43625678778446,64.53537113071928,,0,0,0,64.53537113071928,31.513733523110222,,0,0,0,31.513733523110222,117.80804866180486,,0,0,0,117.80804866180486
63,LYS,8.176680545115994,,0,0,0,8.176680545115994,4.170138199184149,,0,0,0,4.170138199184149,177.35457975558884,,0,0,0,177.35457975558884,58.040114051504055,,0,0,0,58.040114051504055,32.15830107092352,,0,0,0,32.15830107092352,118.73229266400821,,0,0,0,118.73229266400821
64,GLU,7.708140872388723,,0,0,0,7.708140872388723,4.251533756143856,,0,0,0,4.251533756143856,175.52388551956375,,0,0,0,175.52388551956375,57.69609169109224,,0,0,0,57.69609169109224,30.73818279256854,,0,0,0,30.73818279256854,117.50136931461317,,0,0,0,117.50136931461317
65,VAL,7.37709607025752,,0,0,0,7.37709607025752,4.2469476840492835,,0,0,0,4.2469476840492835,174.59952047014653,,0,0,0,174.59952047014653,62.41318488505384,,0,0,0,62.41318488505384,32.47850598421024,,0,0,0,32.47850598421024,119.39757316267621,,0,0,0,119.39757316267621
66,LYS,8.911665226934176,,0,0,0,8.911665226934176,4.765649555622156,,0,0,0,4.765649555622156,175.32660795009434,,0,0,0,175.32660795009434,54.838578445154845,,0,0,0,54.838578445154845,34.08970011828727,,0,0,0,34.08970011828727,127.90562775696526,,0,0,0,127.90562775696526
67,LEU,8.877246597241648,,0,0,0,8.877246597241648,5.17915582045732,,0,0,0,5.17915582045732,175.5938102973249,,0,0,0,175.5938102973249,53.52855932474748,,0,0,0,53.52855932474748,45.07581651014541,,0,0,0,45.07581651014541,125.31222086399711,,0,0,0,125.31222086399711
68,ILE,9.064192336790986,,0,0,0,9.064192336790986,4.97685315939061,,0,0,0,4.97685315939061,175.57502473972139,,0,0,0,175.57502473972139,60.42634118871684,,0,0,0,60.42634118871684,40.99091866243756,,0,0,0,40.99091866243756,121.20599911779887,,0,0,0,121.20599911779887
69,SER,8.81544115879121,,0,0,0,8.81544115879121,4.983589925441225,,0,0,0,4.983589925441225,174.89771586305915,,0,0,0,174.89771586305915,56.058458065617714,,0,0,0,56.058458065617714,64.84084191426906,,0,0,0,64.84084191426906,121.77177948131867,,0,0,0,121.77177948131867
70,ALA,9.244525735014985,,0,0,0,9.244525735014985,4.109581424217449,,0,0,0,4.109581424217449,177.552586950888,,0,0,0,177.552586950888,52.93580541655567,,0,0,0,52.93580541655567,17.618466342235543,,0,0,0,17.618466342235543,131.24060060226995,,0,0,0,131.24060060226995
71,GLY,8.597752787162838,,0,0,0,8.597752787162838,3.8500720200577203,,0,0,0,3.8500720200577203,173.56377223928294,,0,0,0,173.56377223928294,45.38058236578976,,0,0,0,45.38058236578976,,,0,0,0,,103.703879264985,,0,0,0,103.703879264985
72,LYS,7.752114338150737,,0,0,0,7.752114338150737,4.69988172964258,,0,0,0,4.69988172964258,175.33361104104227,,0,0,0,175.33361104104227,54.56331676105006,,0,0,0,54.56331676105006,34.64384775473416,,0,0,0,34.64384775473416,121.56136900384615,,0,0,0,121.56136900384615
73,VAL,8.654523243284492,,0,0,0,8.654523243284492,4.245990652597403,,0,0,0,4.245990652597403,176.2264169241592,,0,0,0,176.2264169241592,62.63914929040404,,0,0,0,62.63914929040404,32.3596919005439,,0,0,0,32.3596919005439,124.54531625451216,,0,0,0,124.54531625451216
74,LEU,8.557449053280054,,0,0,0,8.557449053280054,4.085924798962149,,0,0,0,4.085924798962149,176.2657658979243,,0,0,0,176.2657658979243,54.28052389632035,,0,0,0,54.28052389632035,42.216805476295924,,0,0,0,42.216805476295924,128.91030198186814,,0,0,0,128.91030198186814
75,GLU,8.857455109862359,,0,0,0,8.857455109862359,4.548985908924409,,0,0,0,4.548985908924409,177.03256512248308,,0,0,0,177.03256512248308,55.51330435457321,,0,0,0,55.51330435457321,31.281482403957153,,0,0,0,31.281482403957153,122.66377223900544,,0,0,0,122.66377223900544
76,ASN,8.728267533322233,,0,0,0,8.728267533322233,4.487165114729715,,0,0,0,4.487165114729715,175.60475252363747,,0,0,0,175.60475252363747,55.26629018214008,,0,0,0,55.26629018214008,38.61804267723387,,0,0,0,38.61804267723387,120.90279800995117,,0,0,0,120.90279800995117
77,SER,8.091356553008103,,0,0,0,8.091356553008103,4.393841049370074,,0,0,0,4.393841049370074,174.36948750680986,,0,0,0,174.36948750680986,58.91022419727494,,0,0,0,58.91022419727494,63.129752076323676,,0,0,0,63.129752076323676,112.89843271028417,,0,0,0,112.89843271028417
78,LYS,7.818297128588078,,0,0,0,7.818297128588078,4.636320965900766,,0,0,0,4.636320965900766,175.68712564941168,,0,0,0,175.68712564941168,55.16757067945943,,0,0,0,55.16757067945943,34.6643732436619,,0,0,0,34.6643732436619,122.27159823031414,,0,0,0,122.27159823031414
79,THR,8.383976258918858,,0,0,0,8.383976258918858,5.147197158452658,,0,0,0,5.147197158452658,176.36359350329116,,0,0,0,176.36359350329116,59.75097168495948,,0,0,0,59.75097168495948,72.29175845201465,,0,0,0,72.29175845201465,109.94322573134642,,0,0,0,109.94322573134642
80,VAL,9.456116403063602,,0,0,0,9.456116403063602,3.5002470210317456,,0,0,0,3.5002470210317456,177.8143999471695,,0,0,0,177.8143999471695,66.92038073104118,,0,0,0,66.92038073104118,31.550515319391717,,0,0,0,31.550515319391717,122.71716864910645,,0,0,0,122.71716864910645
81,LYS,8.254356501376401,,0,0,0,8.254356501376401,3.889548486965812,,0,0,0,3.889548486965812,178.56033553053058,,0,0,0,178.56033553053058,59.90903620473416,,0,0,0,59.90903620473416,32.144462882417585,,0,0,0,32.144462882417585,118.85163866820957,,0,0,0,118.85163866820957
82,ASP,7.79726118031413,,0,0,0,7.79726118031413,4.389184265734266,,0,0,0,4.389184265734266,177.57494018083028,,0,0,0,177.57494018083028,56.63281357148962,,0,0,0,56.63281357148962,41.3387911997336,,0,0,0,41.3387911997336,118.99145912492507,,0,0,0,118.99145912492507
83,TYR,7.636178508219558,,0,0,0,7.636178508219558,4.559085543290044,,0,0,0,4.559085543290044,175.78478391931958,,0,0,0,175.78478391931958,58.90582056972472,,0,0,0,58.90582056972472,39.44889782154512,,0,0,0,39.44889782154512,115.90305861460206,,0,0,0,115.90305861460206
84,ARG,7.820691385070486,,0,0,0,7.820691385070486,4.35466518027528,,0,0,0,4.35466518027528,176.05055287113444,,0,0,0,176.05055287113444,56.58804951358086,,0,0,0,56.58804951358086,30.19754052113997,,0,0,0,30.19754052113997,122.37970681264291,,0,0,0,122.37970681264291
85,SER,8.28195346149406,,0,0,0,8.28195346149406,4.657393582733933,,0,0,0,4.657393582733933,174.410199326751,,0,0,0,174.410199326751,56.23755267085137,,0,0,0,56.23755267085137,64.3346728977578,,0,0,0,64.3346728977578,122.41623472027972,,0,0,0,122.41623472027972
86,PRO,,,0,0,0,,4.31987301564824,,0,0,0,4.31987301564824,178.2149150344933,,0,0,0,178.2149150344933,64.94206632000221,,0,0,0,64.94206632000221,31.73612538192363,,0,0,0,31.73612538192363,,,0,0,0,
87,VAL,8.026722487185037,,0,0,0,8.026722487185037,3.9489265658286152,,0,0,0,3.9489265658286152,176.76381155548896,,0,0,0,176.76381155548896,63.92390722653458,,0,0,0,63.92390722653458,31.941497007381507,,0,0,0,31.941497007381507,118.02105333757909,,0,0,0,118.02105333757909
88,SER,8.104524224225775,,0,0,0,8.104524224225775,4.400664958308358,,0,0,0,4.400664958308358,175.01335593988787,,0,0,0,175.01335593988787,59.234255499006544,,0,0,0,59.234255499006544,63.23824107306582,,0,0,0,63.23824107306582,115.30555875940726,,0,0,0,115.30555875940726
89,ASN,7.876205740342991,,0,0,0,7.876205740342991,4.660487552186702,,0,0,0,4.660487552186702,175.3617055634976,,0,0,0,175.3617055634976,53.00111820061605,,0,0,0,53.00111820061605,39.046390976423574,,0,0,0,39.046390976423574,119.22643953715729,,0,0,0,119.22643953715729