RESNUM,RESNAME,H_X,H_Y,H_BEST_REF_SCORE,H_BEST_REF_COV,H_BEST_REF_MATCH,H_UCBShift,HA_X,HA_Y,HA_BEST_REF_SCORE,HA_BEST_REF_COV,HA_BEST_REF_MATCH,HA_UCBShift,C_X,C_Y,C_BEST_REF_SCORE,C_BEST_REF_COV,C_BEST_REF_MATCH,C_UCBShift,CA_X,CA_Y,CA_BEST_REF_SCORE,CA_BEST_REF_COV,CA_BEST_REF_MATCH,CA_UCBShift,CB_X,CB_Y,CB_BEST_REF_SCORE,CB_BEST_REF_COV,CB_BEST_REF_MATCH,CB_UCBShift,N_X,N_Y,N_BEST_REF_SCORE,N_BEST_REF_COV,N_BEST_REF_MATCH,N_UCBShift
1,GLY,8.415208716672216,,0.0,0.0,0,8.415208716672216,3.936255379523254,,0.0,0.0,0,3.936255379523254,174.3138629942835,,0.0,0.0,0,174.3138629942835,45.007877134437784,,0.0,0.0,0,45.007877134437784,,,0.0,0.0,0,,110.05578285925185,,0.0,0.0,0,110.05578285925185
2,SER,8.362213371017871,,0.0,0.0,0,8.362213371017871,4.48398458008103,,0.0,0.0,0,4.48398458008103,174.09522150081585,,0.0,0.0,0,174.09522150081585,58.07134331250971,,0.0,0.0,0,58.07134331250971,63.85604683969919,,0.0,0.0,0,63.85604683969919,117.1722314977023,,0.0,0.0,0,117.1722314977023
3,SER,8.28865214034854,,0.0,0.0,0,8.28865214034854,4.445010341797092,,0.0,0.0,0,4.445010341797092,174.63700493581973,,0.0,0.0,0,174.63700493581973,58.268281870229764,,0.0,0.0,0,58.268281870229764,63.66174383452103,,0.0,0.0,0,63.66174383452103,118.64584998626928,,0.0,0.0,0,118.64584998626928
4,GLY,8.34569956993007,,0.0,0.0,0,8.34569956993007,3.9238576436258183,,0.0,0.0,0,3.9238576436258183,174.4061731097347,,0.0,0.0,0,174.4061731097347,45.512050821595075,,0.0,0.0,0,45.512050821595075,,,0.0,0.0,0,,111.09025323271727,,0.0,0.0,0,111.09025323271727
5,SER,8.33306666087801,,0.0,0.0,0,8.33306666087801,4.523530311643912,,0.0,0.0,0,4.523530311643912,174.9530750651515,,0.0,0.0,0,174.9530750651515,57.46352871681096,,0.0,0.0,0,57.46352871681096,63.78934943498723,,0.0,0.0,0,63.78934943498723,117.73151383904984,,0.0,0.0,0,117.73151383904984
6,SER,8.362567558041958,,0.0,0.0,0,8.362567558041958,4.3888608005161505,4.41,0.22499190273167813,0.9655172413793104,1,4.428728542746143,174.98631560131534,175.21,0.22499190273167813,0.9655172413793104,1,175.33057723776224,59.32029428037518,58.59,0.22499190273167813,0.9655172413793104,1,58.71345318232878,63.039896386796535,,0.0,0.0,0,63.039896386796535,118.51177594755245,,0.0,0.0,0,118.51177594755245
7,GLY,8.282223645182595,8.43,0.22499190273167813,0.9655172413793104,1,8.466485550777001,3.9728524772449774,,0.0,0.0,0,3.9728524772449774,175.14973626423577,175.18,0.22499190273167813,0.9655172413793104,1,175.29402430229214,45.48704125941281,45.51,0.22499190273167813,0.9655172413793104,1,45.44564477628483,,,0.0,0.0,0,,110.18162510858586,,0.0,0.0,0,110.18162510858586
8,GLU,8.430491087384837,8.26,0.22499190273167813,0.9655172413793104,1,8.305703835730936,4.115497982217782,4.05,0.22499190273167813,0.9655172413793104,1,4.089911210639361,178.31830452499167,178.15,0.22499190273167813,0.9655172413793104,1,178.13957610996226,58.84818354095904,57.71,0.22499190273167813,0.9655172413793104,1,57.98908028581418,29.580270105200356,29.79,0.22499190273167813,0.9655172413793104,1,29.764070862210012,119.76815063717949,121.0,0.22499190273167813,0.9655172413793104,1,121.24750393850594
9,VAL,7.789696997569097,7.88,0.22499190273167813,0.9655172413793104,1,7.8931764089022085,4.010139937862138,3.91,0.22499190273167813,0.9655172413793104,1,3.9245971224941725,176.9688825378011,175.3,0.22499190273167813,0.9655172413793104,1,175.57704710507272,64.20942173459318,63.54,0.22499190273167813,0.9655172413793104,1,63.642525522444224,31.740134386230437,31.9,0.22499190273167813,0.9655172413793104,1,31.89637498875014,115.57400292392607,117.73,0.22499190273167813,0.9655172413793104,1,117.68829310440671
10,GLN,7.7712828073759574,7.67,0.22499190273167813,0.9655172413793104,1,7.673811064985015,4.246841614541014,4.06,0.22499190273167813,0.9655172413793104,1,4.1007180403540895,176.50150813291708,176.26,0.22499190273167813,0.9655172413793104,1,176.33144738805083,56.48723146178821,55.46,0.22499190273167813,0.9655172413793104,1,55.68058449966145,29.041263047147297,28.71,0.22499190273167813,0.9655172413793104,1,28.664686528305026,118.63385068871683,116.84,0.22499190273167813,0.9655172413793104,1,117.33444489669775
11,LYS,7.406374139033189,7.52,0.22499190273167813,0.9655172413793104,1,7.488413869480519,4.502857868786768,4.24,0.22499190273167813,0.9655172413793104,1,4.286761373276723,175.00334198115775,174.62,0.22499190273167813,0.9655172413793104,1,174.64025556302587,54.2116497477911,54.95,0.22499190273167813,0.9655172413793104,1,55.04341357220557,32.09511465897991,31.2,0.22499190273167813,0.9655172413793104,1,31.292323414463315,120.29457419849594,120.55,0.22499190273167813,0.9655172413793104,1,120.84600316378067
12,PRO,,,0.0,0.0,0,,4.368411576634477,4.19,0.22499190273167813,0.9655172413793104,1,4.250780820407371,177.54986539569876,176.97,0.22499190273167813,0.9655172413793104,1,177.15771986338106,62.91736740947941,62.21,0.22499190273167813,0.9655172413793104,1,62.30563349152514,32.26203120854701,32.48,0.22499190273167813,0.9655172413793104,1,32.507745751071155,,,0.0,0.0,0,
13,LEU,8.600303886563436,8.32,0.22499190273167813,0.9655172413793104,1,8.377510506299256,3.7170459478382725,3.32,0.22499190273167813,0.9655172413793104,1,3.3732911045177048,177.86100749178598,176.51,0.22499190273167813,0.9655172413793104,1,176.8531076470807,58.35959631223776,58.1,0.22499190273167813,0.9655172413793104,1,58.11579498947719,41.38363518585304,41.46,0.22499190273167813,0.9655172413793104,1,41.61281462303252,123.77383336912531,121.75,0.22499190273167813,0.9655172413793104,1,122.43102776769896
14,HIS,8.01524326102786,7.45,0.22499190273167813,0.9655172413793104,1,7.490174794560994,4.298473688228438,3.9,0.22499190273167813,0.9655172413793104,1,3.9679315183094683,176.04053702662893,175.73,0.22499190273167813,0.9655172413793104,1,175.8272595084249,57.62002753437673,57.69,0.22499190273167813,0.9655172413793104,1,57.73499026196026,28.472634355550007,29.05,0.22499190273167813,0.9655172413793104,1,29.00822688954379,112.69508048774559,108.01,0.22499190273167813,0.9655172413793104,1,108.47103828760129
15,GLU,7.7341251528749035,7.19,0.22499190273167813,0.9655172413793104,1,7.362853239471639,4.291922022860472,4.19,0.22499190273167813,0.9655172413793104,1,4.208863262581862,176.7141414094794,176.35,0.22499190273167813,0.9655172413793104,1,176.30885585758685,56.07061650939061,55.15,0.22499190273167813,0.9655172413793104,1,55.278372873387724,30.118782382284383,30.61,0.22499190273167813,0.9655172413793104,1,30.59818918393828,118.5058714970474,116.84,0.22499190273167813,0.9655172413793104,1,117.32018845785326
16,GLN,7.4904900674103665,7.25,0.22499190273167813,0.9655172413793104,1,7.326439916766567,4.018250252186702,3.53,0.22499190273167813,0.9655172413793104,1,3.6945056967254963,177.5904643662948,178.05,0.22499190273167813,0.9655172413793104,1,178.06440536547342,55.245383708807864,54.39,0.22499190273167813,0.9655172413793104,1,54.429608775263624,28.07400267939838,,0.0,0.0,0,28.07400267939838,119.57751618310579,118.18,0.22499190273167813,0.9655172413793104,1,118.5599321040404
17,LEU,8.45502482971473,8.89,0.22499190273167813,0.9655172413793104,1,8.840772824897325,3.912842576179376,3.91,0.22499190273167813,0.9655172413793104,1,3.9240993012543015,177.3401833036075,175.99,0.22499190273167813,0.9655172413793104,1,176.24607842700632,57.53638629299034,57.54,0.22499190273167813,0.9655172413793104,1,57.60131714822955,41.624303966855365,42.03,0.22499190273167813,0.9655172413793104,1,41.94042418561438,124.07412903408813,124.01,0.22499190273167813,0.9655172413793104,1,124.23507250197581
18,TRP,6.770580723115772,5.9,0.22499190273167813,0.9655172413793104,1,6.156245788916638,4.9875932874347875,4.97,0.22499190273167813,0.9655172413793104,1,4.97861433993229,175.44415118403262,175.75,0.22499190273167813,0.9655172413793104,1,175.86171660566654,55.172434787939835,52.74,0.22499190273167813,0.9655172413793104,1,53.43935273838384,29.562161648446,28.94,0.22499190273167813,0.9655172413793104,1,28.931987792812745,114.29051112657342,107.08,0.22499190273167813,0.9655172413793104,1,109.01046599005994
19,TYR,7.562230682267732,7.43,0.22499190273167813,0.9655172413793104,1,7.497346295127094,5.452269866172716,5.39,0.22499190273167813,0.9655172413793104,1,5.404000027922078,175.22133976624488,175.62,0.22499190273167813,0.9655172413793104,1,175.68314672652903,58.02569667043512,57.32,0.22499190273167813,0.9655172413793104,1,57.280491734215786,38.88063466137196,39.11,0.22499190273167813,0.9655172413793104,1,39.08138131262626,123.47381621370852,,0.0,0.0,0,123.47381621370852
20,HIS,8.598932237468087,8.86,0.22499190273167813,0.9655172413793104,1,8.866426317338217,4.396103611172162,4.37,0.22499190273167813,0.9655172413793104,1,4.3965792723942725,174.30643682327116,175.02,0.22499190273167813,0.9655172413793104,1,174.99276927568542,55.75061707511932,55.89,0.22499190273167813,0.9655172413793104,1,55.84503927925408,31.720218737734488,33.05,0.22499190273167813,0.9655172413793104,1,32.8581491450161,126.54398531219336,125.3,0.22499190273167813,0.9655172413793104,1,125.57565751382506
21,GLY,5.822664894794093,5.26,0.22499190273167813,0.9655172413793104,1,5.426548910733711,3.7658484598346096,,0.0,0.0,0,3.7658484598346096,174.015610085459,174.08,0.22499190273167813,0.9655172413793104,1,174.18752922373181,45.21578980234765,46.34,0.22499190273167813,0.9655172413793104,1,46.20233049111444,,,0.0,0.0,0,,107.27687360026084,103.9,0.22499190273167813,0.9655172413793104,1,104.30250376592296
22,ALA,8.411258943012543,8.73,0.22499190273167813,0.9655172413793104,1,8.680920226839827,4.514229174403375,5.07,0.22499190273167813,0.9655172413793104,1,4.93029598999889,177.27260357784994,177.12,0.22499190273167813,0.9655172413793104,1,177.27312327210012,51.833345758424905,50.79,0.22499190273167813,0.9655172413793104,1,50.97358504981685,17.98492797979798,16.86,0.22499190273167813,0.9655172413793104,1,17.02946149837385,126.8050945530414,129.67,0.22499190273167813,0.9655172413793104,1,129.71732518093572
23,ILE,7.7580554530913535,7.19,0.22499190273167813,0.9655172413793104,1,7.251701942052392,4.412668262312687,4.54,0.22499190273167813,0.9655172413793104,1,4.519587818420468,174.32093807948164,173.52,0.22499190273167813,0.9655172413793104,1,173.73349894778,58.39917039062604,58.56,0.22499190273167813,0.9655172413793104,1,58.537542682739485,38.89529382508603,38.38,0.22499190273167813,0.9655172413793104,1,38.4782249450383,120.68587397995893,118.11,0.22499190273167813,0.9655172413793104,1,119.03707496323676
24,PRO,,,0.0,0.0,0,,4.546640607506382,4.34,0.22499190273167813,0.9655172413793104,1,4.375915814357865,177.85877591588414,177.87,0.22499190273167813,0.9655172413793104,1,177.98562377395385,62.39135533339438,62.34,0.22499190273167813,0.9655172413793104,1,62.352128909301804,32.63852031951937,32.13,0.22499190273167813,0.9655172413793104,1,32.271408967177265,,,0.0,0.0,0,
25,ARG,8.704416807220557,8.6,0.22499190273167813,0.9655172413793104,1,8.58395404027639,3.864111664246864,3.48,0.22499190273167813,0.9655172413793104,1,3.5392895852036848,177.8983063004662,178.74,0.22499190273167813,0.9655172413793104,1,178.7950310702631,59.54533653028638,59.9,0.22499190273167813,0.9655172413793104,1,59.86687740182595,29.98410613228438,29.87,0.22499190273167813,0.9655172413793104,1,30.020639936291484,122.25424356559552,123.12,0.22499190273167813,0.9655172413793104,1,123.43433989360639
26,ALA,8.228472181668332,8.76,0.22499190273167813,0.9655172413793104,1,8.741410729631479,4.139305076096126,4.05,0.22499190273167813,0.9655172413793104,1,4.079459530924631,179.96584050226443,179.21,0.22499190273167813,0.9655172413793104,1,179.34860522244978,54.96279010243645,54.54,0.22499190273167813,0.9655172413793104,1,54.52941208372739,18.023033012592965,18.48,0.22499190273167813,0.9655172413793104,1,18.461763131773782,120.94693237887113,118.55,0.22499190273167813,0.9655172413793104,1,118.8976947624653
27,GLU,8.423308101615051,7.39,0.22499190273167813,0.9655172413793104,1,7.505200533200133,4.103742319516595,4.09,0.22499190273167813,0.9655172413793104,1,4.118175277355977,178.7964671104784,178.06,0.22499190273167813,0.9655172413793104,1,178.14454902620156,59.234683032128984,57.49,0.22499190273167813,0.9655172413793104,1,57.58447645956821,29.285716398002,29.49,0.22499190273167813,0.9655172413793104,1,29.556107276162727,118.69409782893219,115.16,0.22499190273167813,0.9655172413793104,1,115.8992937513098
28,VAL,8.113429394216894,7.37,0.22499190273167813,0.9655172413793104,1,7.437466538517038,3.5536365174159172,3.29,0.22499190273167813,0.9655172413793104,1,3.357003261133311,177.7247254351926,176.94,0.22499190273167813,0.9655172413793104,1,177.12653331255967,67.07337043522034,66.23,0.22499190273167813,0.9655172413793104,1,66.29325088221223,31.33062287947053,30.98,0.22499190273167813,0.9655172413793104,1,31.111602617044067,119.91666122745033,117.14,0.22499190273167813,0.9655172413793104,1,118.17956692227773
29,ALA,7.9397123802919305,7.52,0.22499190273167813,0.9655172413793104,1,7.570292278904429,4.0406571117243875,3.85,0.22499190273167813,0.9655172413793104,1,3.8703449332223334,179.98363468002555,178.4,0.22499190273167813,0.9655172413793104,1,178.6564984270674,54.76902953218448,54.6,0.22499190273167813,0.9655172413793104,1,54.55358006088911,18.330764197080697,18.06,0.22499190273167813,0.9655172413793104,1,18.166718208885563,120.20910494547674,117.24,0.22499190273167813,0.9655172413793104,1,117.969698609324
30,GLU,8.094363626462426,7.29,0.22499190273167813,0.9655172413793104,1,7.393709177938728,4.137910797211123,4.1,0.22499190273167813,0.9655172413793104,1,4.101563546359197,178.69792574623153,177.2,0.22499190273167813,0.9655172413793104,1,177.5287714697358,58.904161298429344,56.86,0.22499190273167813,0.9655172413793104,1,57.151072895177045,29.857414189144187,29.69,0.22499190273167813,0.9655172413793104,1,29.63563327863803,117.71081284826285,112.54,0.22499190273167813,0.9655172413793104,1,113.54558857670663
31,LEU,7.850842697569099,7.29,0.22499190273167813,0.9655172413793104,1,7.394903198867799,4.202100346586747,4.12,0.22499190273167813,0.9655172413793104,1,4.140112363164613,177.7102962392996,176.07,0.22499190273167813,0.9655172413793104,1,176.39647986365856,56.0643412962704,55.25,0.22499190273167813,0.9655172413793104,1,55.40804379862915,43.13331485295815,,0.0,0.0,0,43.13331485295815,118.12492596653901,117.09,0.22499190273167813,0.9655172413793104,1,117.77301831212677
32,LEU,7.6864079154123655,6.98,0.22499190273167813,0.9655172413793104,1,7.089327757126208,4.362294183802309,4.34,0.22499190273167813,0.9655172413793104,1,4.342143905716506,176.50564060416804,174.59,0.22499190273167813,0.9655172413793104,1,175.01274360357974,54.45232742781663,53.67,0.22499190273167813,0.9655172413793104,1,53.753553808469306,40.89266132132867,42.26,0.22499190273167813,0.9655172413793104,1,41.99563976945832,118.03071686901987,116.12,0.22499190273167813,0.9655172413793104,1,116.70885344267954
33,VAL,7.793190575979575,8.66,0.22499190273167813,0.9655172413793104,1,8.54553574139194,4.036232727036852,3.88,0.22499190273167813,0.9655172413793104,1,3.8924788127095122,176.18840987632368,175.17,0.22499190273167813,0.9655172413793104,1,175.47600330243645,63.27798082600178,63.7,0.22499190273167813,0.9655172413793104,1,63.69272454779665,32.7518421000666,34.86,0.22499190273167813,0.9655172413793104,1,34.679085999112,121.36472537052393,121.45,0.22499190273167813,0.9655172413793104,1,121.8711270939838
34,HIS,8.573651032284383,8.38,0.22499190273167813,0.9655172413793104,1,8.408603936352536,4.869158178632478,4.76,0.22499190273167813,0.9655172413793104,1,4.789482718986569,174.4487963652403,175.3,0.22499190273167813,0.9655172413793104,1,175.12477273059162,54.820188049783546,53.14,0.22499190273167813,0.9655172413793104,1,53.30900504211344,31.475747202442005,32.7,0.22499190273167813,0.9655172413793104,1,32.47713925399601,119.16804263674103,121.05,0.22499190273167813,0.9655172413793104,1,120.86228807519147
35,SER,8.555934857681208,8.86,0.22499190273167813,0.9655172413793104,1,8.85436222860473,4.2483511056332555,3.99,0.22499190273167813,0.9655172413793104,1,4.023958668553668,175.99972043227328,177.11,0.22499190273167813,0.9655172413793104,1,177.04417712407036,60.17073648601953,60.16,0.22499190273167813,0.9655172413793104,1,60.1372329012543,63.06059761311466,62.24,0.22499190273167813,0.9655172413793104,1,62.36813381675547,117.27418562004107,117.01,0.22499190273167813,0.9655172413793104,1,117.2958587396104
36,GLY,9.328390110339662,10.11,0.22499190273167813,0.9655172413793104,1,10.114771110084359,4.39377411000666,,0.0,0.0,0,4.39377411000666,173.96914933083028,175.77,0.22499190273167813,0.9655172413793104,1,175.4227234607226,45.423598305932956,45.31,0.22499190273167813,0.9655172413793104,1,45.26754634254079,,,0.0,0.0,0,,113.94855049385615,115.34,0.22499190273167813,0.9655172413793104,1,115.4010681069375
37,ASP,8.381842071356422,8.82,0.22499190273167813,0.9655172413793104,1,8.81622852945943,5.571342184815185,5.8,0.22499190273167813,0.9655172413793104,1,5.808196362026861,176.0752575291431,176.1,0.22499190273167813,0.9655172413793104,1,176.35136271387503,55.115241190803644,54.24,0.22499190273167813,0.9655172413793104,1,54.333737304867356,41.5583107003552,41.98,0.22499190273167813,0.9655172413793104,1,41.96715533119103,123.1438610505328,127.04,0.22499190273167813,0.9655172413793104,1,126.45871972412033
38,PHE,9.00567853794539,8.85,0.22499190273167813,0.9655172413793104,1,8.980670203485404,5.959457384776335,6.11,0.22499190273167813,0.9655172413793104,1,6.0660472483016985,172.80263237326562,170.9,0.22499190273167813,0.9655172413793104,1,171.27199036112776,55.55318110747586,55.4,0.22499190273167813,0.9655172413793104,1,55.39792287003552,43.705696982417585,45.36,0.22499190273167813,0.9655172413793104,1,45.146943066000674,119.75440273954933,117.78,0.22499190273167813,0.9655172413793104,1,118.42864004476634
39,LEU,9.340985101720502,9.0,0.22499190273167813,0.9655172413793104,1,9.150286532789433,4.990588051548452,4.87,0.22499190273167813,0.9655172413793104,1,4.93777155029415,174.54332867687867,175.01,0.22499190273167813,0.9655172413793104,1,175.12172972802196,54.458474400860254,53.92,0.22499190273167813,0.9655172413793104,1,54.04904718437673,44.846226857054056,44.31,0.22499190273167813,0.9655172413793104,1,44.49665863437118,116.99472596439671,112.91,0.22499190273167813,0.9655172413793104,1,113.88158076545122
40,VAL,9.811364523321124,9.1,0.22499190273167813,0.9655172413793104,1,9.213863496509045,5.059424494777445,5.62,0.22499190273167813,0.9655172413793104,1,5.3926689960095455,174.50331387683428,172.8,0.22499190273167813,0.9655172413793104,1,172.95968765364637,61.43036736736597,60.74,0.22499190273167813,0.9655172413793104,1,60.90813461098347,33.36168397187812,,0.0,0.0,0,33.36168397187812,121.52945529759685,119.0,0.22499190273167813,0.9655172413793104,1,119.61723582317683
41,ARG,9.29891754977245,9.47,0.22499190273167813,0.9655172413793104,1,9.512574733150183,5.25886600109335,5.11,0.22499190273167813,0.9655172413793104,1,5.1261056010767,174.44012616657233,173.08,0.22499190273167813,0.9655172413793104,1,173.41697482959265,52.9401469001665,53.08,0.22499190273167813,0.9655172413793104,1,53.08693334138084,34.26971743912753,33.47,0.22499190273167813,0.9655172413793104,1,33.796445393512045,124.4409152539627,124.01,0.22499190273167813,0.9655172413793104,1,124.20670693422689
42,GLU,8.877050852464203,8.08,0.22499190273167813,0.9655172413793104,1,8.21663821070596,4.7210133269508265,4.97,0.22499190273167813,0.9655172413793104,1,4.97700846031191,176.29899242162836,176.89,0.22499190273167813,0.9655172413793104,1,176.81310091275947,56.33806430017205,54.35,0.22499190273167813,0.9655172413793104,1,54.51010934176934,31.42579761810412,32.06,0.22499190273167813,0.9655172413793104,1,32.09714079931735,123.58046111335887,121.36,0.22499190273167813,0.9655172413793104,1,121.619363196337
43,SER,8.627584616638917,8.7,0.22499190273167813,0.9655172413793104,1,8.7189381488345,4.49046345969031,4.24,0.22499190273167813,0.9655172413793104,1,4.317645428876679,174.94128570497836,174.02,0.22499190273167813,0.9655172413793104,1,174.2246145590798,57.857744706621155,57.81,0.22499190273167813,0.9655172413793104,1,57.77642751405816,64.09430032912643,63.52,0.22499190273167813,0.9655172413793104,1,63.54729796563991,120.30462518343325,121.64,0.22499190273167813,0.9655172413793104,1,121.65471062039072
44,GLN,8.733053511444112,8.46,0.22499190273167813,0.9655172413793104,1,8.478898262859364,4.105019908103008,4.05,0.22499190273167813,0.9655172413793104,1,4.054325149400599,176.83240238241203,177.28,0.22499190273167813,0.9655172413793104,1,177.30068161999668,57.47967163262293,57.3,0.22499190273167813,0.9655172413793104,1,57.33205082596293,28.474399497502496,34.08,0.22499190273167813,0.9655172413793104,1,32.05180473235653,126.67561718778444,121.99,0.22499190273167813,0.9655172413793104,1,123.08596749113664
45,GLY,8.862792841708291,8.66,0.22499190273167813,0.9655172413793104,1,8.687916699045399,3.955360912176712,,0.0,0.0,0,3.955360912176712,173.65092420542237,173.73,0.22499190273167813,0.9655172413793104,1,173.99001307161728,45.452654263308915,45.57,0.22499190273167813,0.9655172413793104,1,45.489708255749804,,,0.0,0.0,0,,111.35910266292596,110.78,0.22499190273167813,0.9655172413793104,1,111.54619915212565
46,LYS,7.828477155638804,7.62,0.22499190273167813,0.9655172413793104,1,7.635197525690975,4.562619965445665,4.22,0.22499190273167813,0.9655172413793104,1,4.301181787390387,176.19664613328894,175.15,0.22499190273167813,0.9655172413793104,1,175.27883707875458,55.35536047123987,55.51,0.22499190273167813,0.9655172413793104,1,55.56292601305916,34.38731148266179,33.76,0.22499190273167813,0.9655172413793104,1,33.85011997397048,120.01937197698413,118.29,0.22499190273167813,0.9655172413793104,1,118.89304248750139
47,GLN,8.494172261521811,8.31,0.22499190273167813,0.9655172413793104,1,8.34245706847597,4.159241696747697,4.07,0.22499190273167813,0.9655172413793104,1,4.129668423704073,175.04387095289155,174.3,0.22499190273167813,0.9655172413793104,1,174.56578957030192,55.805910315684315,55.88,0.22499190273167813,0.9655172413793104,1,55.89598216597292,28.52573104266289,27.16,0.22499190273167813,0.9655172413793104,1,27.3168433514541,121.8733059143301,119.54,0.22499190273167813,0.9655172413793104,1,120.39692538270619
48,GLU,8.150699144749694,7.34,0.22499190273167813,0.9655172413793104,1,7.5515043301254305,4.565815136305361,4.39,0.22499190273167813,0.9655172413793104,1,4.432514232251082,174.3856229118659,173.73,0.22499190273167813,0.9655172413793104,1,174.0371145635531,55.513944909651464,54.7,0.22499190273167813,0.9655172413793104,1,54.71785945914641,31.963935457137307,32.43,0.22499190273167813,0.9655172413793104,1,32.46048706591186,120.33446228528139,120.8,0.22499190273167813,0.9655172413793104,1,121.12906393327783
49,TYR,8.754676955422354,9.33,0.22499190273167813,0.9655172413793104,1,9.290506455960706,5.4061172936951944,5.27,0.22499190273167813,0.9655172413793104,1,5.295459774780775,175.0289412932512,174.19,0.22499190273167813,0.9655172413793104,1,174.37792868979355,57.07149175709846,57.6,0.22499190273167813,0.9655172413793104,1,57.477442698828945,41.002466018875566,40.61,0.22499190273167813,0.9655172413793104,1,40.679386507764455,120.53828892176712,122.94,0.22499190273167813,0.9655172413793104,1,122.65874223129647
50,VAL,9.418790802580752,9.21,0.22499190273167813,0.9655172413793104,1,9.270177474486625,5.085751587590187,4.68,0.22499190273167813,0.9655172413793104,1,4.762733175185924,174.557359695449,173.97,0.22499190273167813,0.9655172413793104,1,174.20417916599513,60.93767311032856,60.65,0.22499190273167813,0.9655172413793104,1,60.802646822494175,34.229773358974356,35.67,0.22499190273167813,0.9655172413793104,1,35.664433042751696,122.4016797089355,120.49,0.22499190273167813,0.9655172413793104,1,120.97976699701965