RESNUM,RESNAME,H_X,H_Y,H_BEST_REF_SCORE,H_BEST_REF_COV,H_BEST_REF_MATCH,H_UCBShift,HA_X,HA_Y,HA_BEST_REF_SCORE,HA_BEST_REF_COV,HA_BEST_REF_MATCH,HA_UCBShift,C_X,C_Y,C_BEST_REF_SCORE,C_BEST_REF_COV,C_BEST_REF_MATCH,C_UCBShift,CA_X,CA_Y,CA_BEST_REF_SCORE,CA_BEST_REF_COV,CA_BEST_REF_MATCH,CA_UCBShift,CB_X,CB_Y,CB_BEST_REF_SCORE,CB_BEST_REF_COV,CB_BEST_REF_MATCH,CB_UCBShift,N_X,N_Y,N_BEST_REF_SCORE,N_BEST_REF_COV,N_BEST_REF_MATCH,N_UCBShift
1,PRO,,,0,0,0,,4.950656544827395,,0,0,0,4.950656544827395,174.85161166352538,,0,0,0,174.85161166352538,62.863031565395715,,0,0,0,62.863031565395715,32.94552375563881,,0,0,0,32.94552375563881,,,0,0,0,
2,LYS,8.955084883827283,,0,0,0,8.955084883827283,4.708516609385059,,0,0,0,4.708516609385059,174.5429684528416,,0,0,0,174.5429684528416,55.384676717643465,,0,0,0,55.384676717643465,36.20388045778111,,0,0,0,36.20388045778111,122.5521148468143,,0,0,0,122.5521148468143
3,ARG,8.797670877744478,,0,0,0,8.797670877744478,5.2459235932511925,,0,0,0,5.2459235932511925,175.3945649554057,,0,0,0,175.3945649554057,55.07331024215229,,0,0,0,55.07331024215229,32.520088034959485,,0,0,0,32.520088034959485,126.75590973676323,,0,0,0,126.75590973676323
4,LEU,9.391003051853703,,0,0,0,9.391003051853703,5.252521642990343,,0,0,0,5.252521642990343,175.55733016291487,,0,0,0,175.55733016291487,53.226284652486406,,0,0,0,53.226284652486406,44.69339168880009,,0,0,0,44.69339168880009,126.23094173069153,,0,0,0,126.23094173069153
5,HIS,9.155082114640914,,0,0,0,9.155082114640914,4.936235814130314,,0,0,0,4.936235814130314,173.7471600528305,,0,0,0,173.7471600528305,55.152486572738376,,0,0,0,55.152486572738376,30.5677047015762,,0,0,0,30.5677047015762,120.97081883126873,,0,0,0,120.97081883126873
6,VAL,8.872228778499277,,0,0,0,8.872228778499277,4.897175901232101,,0,0,0,4.897175901232101,174.5043560566489,,0,0,0,174.5043560566489,60.93942065994561,,0,0,0,60.93942065994561,33.17238344809635,,0,0,0,33.17238344809635,127.65231380232545,,0,0,0,127.65231380232545
7,SER,9.015185165323567,,0,0,0,9.015185165323567,5.125155467837718,,0,0,0,5.125155467837718,174.11798697254966,,0,0,0,174.11798697254966,56.37564952570207,,0,0,0,56.37564952570207,66.40886017915973,,0,0,0,66.40886017915973,120.82041774796315,,0,0,0,120.82041774796315
8,ASN,8.359054936574537,,0,0,0,8.359054936574537,4.131650004390055,,0,0,0,4.131650004390055,174.47471604259627,,0,0,0,174.47471604259627,54.06301386774337,,0,0,0,54.06301386774337,37.72244600997891,,0,0,0,37.72244600997891,118.84862458134089,,0,0,0,118.84862458134089
9,ILE,7.613884894433345,,0,0,0,7.613884894433345,3.8831021798562553,,0,0,0,3.8831021798562553,174.19341801254856,,0,0,0,174.19341801254856,58.4822770502442,,0,0,0,58.4822770502442,38.07360615371851,,0,0,0,38.07360615371851,115.37162366592851,,0,0,0,115.37162366592851
10,PRO,,,0,0,0,,4.094674815351316,,0,0,0,4.094674815351316,177.17494645884116,,0,0,0,177.17494645884116,63.05138488603063,,0,0,0,63.05138488603063,32.15769007692863,,0,0,0,32.15769007692863,,,0,0,0,
11,PHE,8.593782036846488,,0,0,0,8.593782036846488,4.382120544000443,,0,0,0,4.382120544000443,176.67215259556,,0,0,0,176.67215259556,59.80706188288379,,0,0,0,59.80706188288379,38.69209711734377,,0,0,0,38.69209711734377,121.14736970783106,,0,0,0,121.14736970783106
12,ARG,7.969948374897325,,0,0,0,7.969948374897325,4.243957231815407,,0,0,0,4.243957231815407,177.10757993215674,,0,0,0,177.10757993215674,56.73604690672106,,0,0,0,56.73604690672106,30.293783903402154,,0,0,0,30.293783903402154,117.31019539089799,,0,0,0,117.31019539089799
13,PHE,8.179477195071597,,0,0,0,8.179477195071597,4.571288389538239,,0,0,0,4.571288389538239,175.59794133754025,,0,0,0,175.59794133754025,57.506284375513374,,0,0,0,57.506284375513374,38.90846128880564,,0,0,0,38.90846128880564,120.42316243481518,,0,0,0,120.42316243481518
14,ARG,8.842796282900434,,0,0,0,8.842796282900434,4.740114793145743,,0,0,0,4.740114793145743,177.3963622378788,,0,0,0,177.3963622378788,54.29023288327783,,0,0,0,54.29023288327783,32.96836297836053,,0,0,0,32.96836297836053,121.29232827232768,,0,0,0,121.29232827232768
15,ASP,8.95019979074814,,0,0,0,8.95019979074814,4.5183529835608836,,0,0,0,4.5183529835608836,175.99459617917637,,0,0,0,175.99459617917637,58.2346418545954,,0,0,0,58.2346418545954,38.973932535092686,,0,0,0,38.973932535092686,123.94180648121879,,0,0,0,123.94180648121879
16,PRO,,,0,0,0,,4.286228273407149,,0,0,0,4.286228273407149,179.29443690954602,,0,0,0,179.29443690954602,65.75012356570652,,0,0,0,65.75012356570652,31.04115322816628,,0,0,0,31.04115322816628,,,0,0,0,
17,ASP,7.663106540953491,,0,0,0,7.663106540953491,4.279347593259518,,0,0,0,4.279347593259518,178.51229909841825,,0,0,0,178.51229909841825,56.67273455054945,,0,0,0,56.67273455054945,39.66178480883561,,0,0,0,39.66178480883561,118.63786040920192,,0,0,0,118.63786040920192
18,LEU,7.958624718958819,,0,0,0,7.958624718958819,4.239461855350205,,0,0,0,4.239461855350205,179.14029155323564,,0,0,0,179.14029155323564,57.92345938707404,,0,0,0,57.92345938707404,41.734372654817406,,0,0,0,41.734372654817406,120.57721787595182,,0,0,0,120.57721787595182
19,ARG,8.620580257675659,,0,0,0,8.620580257675659,3.8243290553474307,,0,0,0,3.8243290553474307,178.68049488909426,,0,0,0,178.68049488909426,60.46740293614719,,0,0,0,60.46740293614719,30.12680608181818,,0,0,0,30.12680608181818,120.0399814029415,,0,0,0,120.0399814029415
20,GLN,7.998081371245422,,0,0,0,7.998081371245422,4.068506241921967,,0,0,0,4.068506241921967,178.33111536380287,,0,0,0,178.33111536380287,58.72643291743812,,0,0,0,58.72643291743812,28.42410994090909,,0,0,0,28.42410994090909,118.83661269249639,,0,0,0,118.83661269249639
21,MET,8.214162262187811,,0,0,0,8.214162262187811,4.117637997813298,,0,0,0,4.117637997813298,178.41938363679654,,0,0,0,178.41938363679654,58.468003642468645,,0,0,0,58.468003642468645,33.38775919283494,,0,0,0,33.38775919283494,118.84429869846264,,0,0,0,118.84429869846264
22,PHE,9.057806931124432,,0,0,0,9.057806931124432,4.561716656182706,,0,0,0,4.561716656182706,178.61264304299036,,0,0,0,178.61264304299036,61.24896909790765,,0,0,0,61.24896909790765,39.67788800830281,,0,0,0,39.67788800830281,116.99550684199689,,0,0,0,116.99550684199689
23,GLY,8.527273203979354,,0,0,0,8.527273203979354,3.9680388658313905,,0,0,0,3.9680388658313905,176.10069001137197,,0,0,0,176.10069001137197,46.319705960195364,,0,0,0,46.319705960195364,,,0,0,0,,108.82089668374402,,0,0,0,108.82089668374402
24,GLN,7.974043448340549,,0,0,0,7.974043448340549,4.056600572000222,,0,0,0,4.056600572000222,176.65598978640804,,0,0,0,176.65598978640804,57.53619013044178,,0,0,0,57.53619013044178,27.852537678682427,,0,0,0,27.852537678682427,118.91215981341436,,0,0,0,118.91215981341436
25,PHE,8.069003707298258,,0,0,0,8.069003707298258,4.5145199474747475,,0,0,0,4.5145199474747475,175.51811426629482,,0,0,0,175.51811426629482,57.940075976390276,,0,0,0,57.940075976390276,39.69799583145743,,0,0,0,39.69799583145743,117.97057438832279,,0,0,0,117.97057438832279
26,GLY,7.567668862526363,,0,0,0,7.567668862526363,4.3277423307165055,,0,0,0,4.3277423307165055,171.99674997769452,,0,0,0,171.99674997769452,45.1849033478688,,0,0,0,45.1849033478688,,,0,0,0,,107.28812641197136,,0,0,0,107.28812641197136
27,LYS,8.44114539159729,,0,0,0,8.44114539159729,4.347686846536797,,0,0,0,4.347686846536797,176.02451434579865,,0,0,0,176.02451434579865,56.38000056629482,,0,0,0,56.38000056629482,32.87554644061494,,0,0,0,32.87554644061494,119.38366419812965,,0,0,0,119.38366419812965
28,ILE,8.697302228071928,,0,0,0,8.697302228071928,4.052033698809524,,0,0,0,4.052033698809524,175.89349617113442,,0,0,0,175.89349617113442,61.274601649667,,0,0,0,61.274601649667,38.43320741462426,,0,0,0,38.43320741462426,126.44009424114775,,0,0,0,126.44009424114775
29,LEU,9.030488343833944,,0,0,0,9.030488343833944,4.269488293672994,,0,0,0,4.269488293672994,177.5320357683039,,0,0,0,177.5320357683039,56.2786346454379,,0,0,0,56.2786346454379,42.60535810695416,,0,0,0,42.60535810695416,129.3164070998113,,0,0,0,129.3164070998113
30,ASP,7.742428825291375,,0,0,0,7.742428825291375,4.857662681163281,,0,0,0,4.857662681163281,174.02269409034855,,0,0,0,174.02269409034855,53.53877098276168,,0,0,0,53.53877098276168,44.29650478610834,,0,0,0,44.29650478610834,116.5823060342935,,0,0,0,116.5823060342935
31,VAL,8.275714238716837,,0,0,0,8.275714238716837,4.88780432035742,,0,0,0,4.88780432035742,174.19737139269066,,0,0,0,174.19737139269066,61.328234833438785,,0,0,0,61.328234833438785,34.79470823831724,,0,0,0,34.79470823831724,122.39081412657343,,0,0,0,122.39081412657343
32,GLU,8.873057685531135,,0,0,0,8.873057685531135,4.82576073028638,,0,0,0,4.82576073028638,175.13429399267397,,0,0,0,175.13429399267397,54.85932133429348,,0,0,0,54.85932133429348,32.943307947463644,,0,0,0,32.943307947463644,127.86059058665778,,0,0,0,127.86059058665778
33,ILE,8.902434797774447,,0,0,0,8.902434797774447,4.132634815506716,,0,0,0,4.132634815506716,174.98027835656566,,0,0,0,174.98027835656566,60.82855559219669,,0,0,0,60.82855559219669,39.42166015781996,,0,0,0,39.42166015781996,125.98147059121989,,0,0,0,125.98147059121989
34,ILE,8.405264678438229,,0,0,0,8.405264678438229,4.336996371395272,,0,0,0,4.336996371395272,174.78109009345656,,0,0,0,174.78109009345656,59.51827105820846,,0,0,0,59.51827105820846,37.98717581078921,,0,0,0,37.98717581078921,126.8569747300644,,0,0,0,126.8569747300644
35,PHE,8.98263782094572,,0,0,0,8.98263782094572,5.075798759507159,,0,0,0,5.075798759507159,175.59725550799203,,0,0,0,175.59725550799203,56.459684724037075,,0,0,0,56.459684724037075,42.12326103704629,,0,0,0,42.12326103704629,126.10520422610168,,0,0,0,126.10520422610168
36,ASN,8.988328371289821,,0,0,0,8.988328371289821,4.916670470740371,,0,0,0,4.916670470740371,176.18434554569873,,0,0,0,176.18434554569873,51.71238003464314,,0,0,0,51.71238003464314,40.35962443986014,,0,0,0,40.35962443986014,119.5382376953158,,0,0,0,119.5382376953158
37,GLU,8.857159908175158,,0,0,0,8.857159908175158,4.1092027875457875,,0,0,0,4.1092027875457875,177.53436712965367,,0,0,0,177.53436712965367,58.746576101193256,,0,0,0,58.746576101193256,29.16384378165723,,0,0,0,29.16384378165723,118.19065348220668,,0,0,0,118.19065348220668
38,ARG,8.023464771178821,,0,0,0,8.023464771178821,4.421889607170607,,0,0,0,4.421889607170607,176.20601910301366,,0,0,0,176.20601910301366,56.253334465706516,,0,0,0,56.253334465706516,30.391124646941947,,0,0,0,30.391124646941947,118.97421518262848,,0,0,0,118.97421518262848
39,GLY,7.864513614907315,,0,0,0,7.864513614907315,4.308873155511156,,0,0,0,4.308873155511156,173.3609011899101,,0,0,0,173.3609011899101,44.679257693856144,,0,0,0,44.679257693856144,,,0,0,0,,108.93029671405816,,0,0,0,108.93029671405816
40,SER,8.66337826904207,,0,0,0,8.66337826904207,3.8675237228604726,,0,0,0,3.8675237228604726,174.93572322703963,,0,0,0,174.93572322703963,58.87141941894217,,0,0,0,58.87141941894217,63.72480515935176,,0,0,0,63.72480515935176,116.94887662062938,,0,0,0,116.94887662062938
41,LYS,9.042559145976245,,0,0,0,9.042559145976245,4.5122742403873906,,0,0,0,4.5122742403873906,176.97001036734375,,0,0,0,176.97001036734375,56.50518259710845,,0,0,0,56.50518259710845,33.345848621178824,,0,0,0,33.345848621178824,125.50956308297815,,0,0,0,125.50956308297815
42,GLY,8.361256292729493,,0,0,0,8.361256292729493,3.743283678202353,,0,0,0,3.743283678202353,172.75631327890443,,0,0,0,172.75631327890443,46.09968534005439,,0,0,0,46.09968534005439,,,0,0,0,,108.67934188094682,,0,0,0,108.67934188094682
43,PHE,7.342140793678545,,0,0,0,7.342140793678545,5.414883142368741,,0,0,0,5.414883142368741,172.88685044151958,,0,0,0,172.88685044151958,55.41445912721723,,0,0,0,55.41445912721723,42.24027545744811,,0,0,0,42.24027545744811,114.09283888535909,,0,0,0,114.09283888535909
44,GLY,8.961352953141304,,0,0,0,8.961352953141304,3.9926725861610617,,0,0,0,3.9926725861610617,170.93329686863692,,0,0,0,170.93329686863692,46.09842710502276,,0,0,0,46.09842710502276,,,0,0,0,,107.3248268007326,,0,0,0,107.3248268007326
45,PHE,9.160995291847042,,0,0,0,9.160995291847042,5.576778306887557,,0,0,0,5.576778306887557,174.67247601759908,,0,0,0,174.67247601759908,56.376304081990234,,0,0,0,56.376304081990234,43.96720143954934,,0,0,0,43.96720143954934,117.37290398877234,,0,0,0,117.37290398877234
46,VAL,8.780020257120658,,0,0,0,8.780020257120658,4.571226438655788,,0,0,0,4.571226438655788,174.23124713250084,,0,0,0,174.23124713250084,60.939874254523254,,0,0,0,60.939874254523254,34.87956045059385,,0,0,0,34.87956045059385,121.7004766444944,,0,0,0,121.7004766444944
47,THR,8.76742456015096,,0,0,0,8.76742456015096,5.11123782998113,,0,0,0,5.11123782998113,174.26679383393827,,0,0,0,174.26679383393827,61.64833366190476,,0,0,0,61.64833366190476,69.42272177633477,,0,0,0,69.42272177633477,124.13904807651792,,0,0,0,124.13904807651792
48,PHE,9.494784879953379,,0,0,0,9.494784879953379,4.902670245487846,,0,0,0,4.902670245487846,176.5254338281552,,0,0,0,176.5254338281552,58.473486262826064,,0,0,0,58.473486262826064,41.32587380838051,,0,0,0,41.32587380838051,125.9627162038073,,0,0,0,125.9627162038073
49,GLU,9.190144915023865,,0,0,0,9.190144915023865,4.0500950719252975,,0,0,0,4.0500950719252975,176.2475387574925,,0,0,0,176.2475387574925,59.41021558437119,,0,0,0,59.41021558437119,30.460139076312576,,0,0,0,30.460139076312576,122.50640594457765,,0,0,0,122.50640594457765
50,ASN,8.07999542042957,,0,0,0,8.07999542042957,4.936608237950939,,0,0,0,4.936608237950939,176.09060186307025,,0,0,0,176.09060186307025,52.13539276992452,,0,0,0,52.13539276992452,40.34207562429237,,0,0,0,40.34207562429237,115.79690669078144,,0,0,0,115.79690669078144
51,SER,8.927851517249417,,0,0,0,8.927851517249417,4.097259731174381,,0,0,0,4.097259731174381,175.91881127944833,,0,0,0,175.91881127944833,61.88802278105783,,0,0,0,61.88802278105783,62.87645938236208,,0,0,0,62.87645938236208,119.530741698113,,0,0,0,119.530741698113
52,ALA,8.383645056438006,,0,0,0,8.383645056438006,4.0994542673493175,,0,0,0,4.0994542673493175,180.5293938027639,,0,0,0,180.5293938027639,55.0550086542069,,0,0,0,55.0550086542069,18.237287015390166,,0,0,0,18.237287015390166,124.18835223358307,,0,0,0,124.18835223358307
53,ASP,7.948463211410812,,0,0,0,7.948463211410812,4.382609791733267,,0,0,0,4.382609791733267,178.03648219188034,,0,0,0,178.03648219188034,56.65204323051393,,0,0,0,56.65204323051393,40.526001145920745,,0,0,0,40.526001145920745,118.61176402508603,,0,0,0,118.61176402508603
54,ALA,7.752024370601621,,0,0,0,7.752024370601621,3.212022543179044,,0,0,0,3.212022543179044,179.39499234017094,,0,0,0,179.39499234017094,55.15008390595516,,0,0,0,55.15008390595516,18.354869131818184,,0,0,0,18.354869131818184,124.07091013126873,,0,0,0,124.07091013126873
55,ASP,8.374340145670995,,0,0,0,8.374340145670995,4.282294345165945,,0,0,0,4.282294345165945,178.8952121397214,,0,0,0,178.8952121397214,57.595393727544675,,0,0,0,57.595393727544675,40.129307085192586,,0,0,0,40.129307085192586,118.39597515716507,,0,0,0,118.39597515716507
56,ARG,7.8588060706571214,,0,0,0,7.8588060706571214,4.028113984548784,,0,0,0,4.028113984548784,178.34733946105007,,0,0,0,178.34733946105007,59.13744568132978,,0,0,0,59.13744568132978,30.137372298795647,,0,0,0,30.137372298795647,121.55311119816295,,0,0,0,121.55311119816295
57,ALA,8.172446362837164,,0,0,0,8.172446362837164,3.075322913747363,,0,0,0,3.075322913747363,179.10036362591853,,0,0,0,179.10036362591853,54.67236107160062,,0,0,0,54.67236107160062,18.26986030848596,,0,0,0,18.26986030848596,122.89535088914418,,0,0,0,122.89535088914418
58,ARG,8.509625468026417,,0,0,0,8.509625468026417,3.773826387900988,,0,0,0,3.773826387900988,178.19213516793207,,0,0,0,178.19213516793207,60.28401674608725,,0,0,0,60.28401674608725,29.896366488439337,,0,0,0,29.896366488439337,119.51988240099345,,0,0,0,119.51988240099345
59,GLU,8.2880548509657,,0,0,0,8.2880548509657,3.986787041561217,,0,0,0,3.986787041561217,178.67436882591852,,0,0,0,178.67436882591852,59.40619828513154,,0,0,0,59.40619828513154,29.527393935409034,,0,0,0,29.527393935409034,118.51421131420247,,0,0,0,118.51421131420247
60,LYS,8.012687224242423,,0,0,0,8.012687224242423,4.177962784265734,,0,0,0,4.177962784265734,178.63430923750138,,0,0,0,178.63430923750138,57.62678770052725,,0,0,0,57.62678770052725,33.074855493523145,,0,0,0,33.074855493523145,116.55325625501722,,0,0,0,116.55325625501722
61,LEU,8.116202385092684,,0,0,0,8.116202385092684,4.265488666572317,,0,0,0,4.265488666572317,178.20446213450992,,0,0,0,178.20446213450992,55.87392959366189,,0,0,0,55.87392959366189,42.6958922043734,,0,0,0,42.6958922043734,116.44637129513264,,0,0,0,116.44637129513264
62,HIS,8.261957557881008,,0,0,0,8.261957557881008,4.199649795498946,,0,0,0,4.199649795498946,176.33760137342657,,0,0,0,176.33760137342657,58.652042160911314,,0,0,0,58.652042160911314,29.408957752647353,,0,0,0,29.408957752647353,119.27025075634921,,0,0,0,119.27025075634921
63,GLY,8.86210649002109,,0,0,0,8.86210649002109,3.83292995540293,,0,0,0,3.83292995540293,174.6397291878677,,0,0,0,174.6397291878677,45.46988763628039,,0,0,0,45.46988763628039,,,0,0,0,,115.92953167474748,,0,0,0,115.92953167474748
64,THR,7.906008394938395,,0,0,0,7.906008394938395,4.332747818145743,,0,0,0,4.332747818145743,173.5787801739649,,0,0,0,173.5787801739649,61.73801953837273,,0,0,0,61.73801953837273,70.86066669670885,,0,0,0,70.86066669670885,113.05844344831834,,0,0,0,113.05844344831834
65,VAL,8.305638915762016,,0,0,0,8.305638915762016,4.604976500921301,,0,0,0,4.604976500921301,176.14051254921745,,0,0,0,176.14051254921745,61.48286845612721,,0,0,0,61.48286845612721,32.519689577539125,,0,0,0,32.519689577539125,121.59578663655789,,0,0,0,121.59578663655789
66,VAL,9.082945421706071,,0,0,0,9.082945421706071,4.302602175463425,,0,0,0,4.302602175463425,175.96525332054614,,0,0,0,175.96525332054614,61.49756566594517,,0,0,0,61.49756566594517,34.0362979467144,,0,0,0,34.0362979467144,128.4005678950605,,0,0,0,128.4005678950605
67,GLU,9.472520797119547,,0,0,0,9.472520797119547,4.012865276909203,,0,0,0,4.012865276909203,176.25548767037407,,0,0,0,176.25548767037407,57.36944071943612,,0,0,0,57.36944071943612,28.46417649156399,,0,0,0,28.46417649156399,127.70970634217448,,0,0,0,127.70970634217448
68,GLY,8.491896887368187,,0,0,0,8.491896887368187,3.809820980364081,,0,0,0,3.809820980364081,173.86342134733044,,0,0,0,173.86342134733044,45.34723078127983,,0,0,0,45.34723078127983,,,0,0,0,,103.69315453541458,,0,0,0,103.69315453541458
69,ARG,7.803361149272949,,0,0,0,7.803361149272949,4.567343626251526,,0,0,0,4.567343626251526,174.92764484596515,,0,0,0,174.92764484596515,54.58512877291597,,0,0,0,54.58512877291597,32.102172681440784,,0,0,0,32.102172681440784,121.78017077964813,,0,0,0,121.78017077964813
70,LYS,8.536763491641691,,0,0,0,8.536763491641691,4.480482490370741,,0,0,0,4.480482490370741,176.47756710976245,,0,0,0,176.47756710976245,55.71086563761239,,0,0,0,55.71086563761239,32.902296041774896,,0,0,0,32.902296041774896,125.1752292072927,,0,0,0,125.1752292072927
71,ILE,8.796355294022645,,0,0,0,8.796355294022645,4.393174182378733,,0,0,0,4.393174182378733,175.23118760320236,,0,0,0,175.23118760320236,61.13856083331113,,0,0,0,61.13856083331113,39.25358828131313,,0,0,0,39.25358828131313,124.5882232952825,,0,0,0,124.5882232952825
72,GLU,8.638542813203463,,0,0,0,8.638542813203463,4.595166134487735,,0,0,0,4.595166134487735,175.62870987802754,,0,0,0,175.62870987802754,55.12477533214563,,0,0,0,55.12477533214563,32.21271903377178,,0,0,0,32.21271903377178,123.52296453315019,,0,0,0,123.52296453315019
73,VAL,8.783556799134198,,0,0,0,8.783556799134198,4.9913221560384065,,0,0,0,4.9913221560384065,175.2919731442502,,0,0,0,175.2919731442502,60.97676429632035,,0,0,0,60.97676429632035,33.8205211453935,,0,0,0,33.8205211453935,124.2900313565601,,0,0,0,124.2900313565601
74,ASN,9.135275781329781,,0,0,0,9.135275781329781,4.999527266189366,,0,0,0,4.999527266189366,174.03443334430568,,0,0,0,174.03443334430568,51.56552405470641,,0,0,0,51.56552405470641,42.515864238855585,,0,0,0,42.515864238855585,125.46207801204352,,0,0,0,125.46207801204352
75,ASN,8.961922243378844,,0,0,0,8.961922243378844,4.696203866178267,,0,0,0,4.696203866178267,175.40724076918082,,0,0,0,175.40724076918082,54.33982889053169,,0,0,0,54.33982889053169,38.42414664261849,,0,0,0,38.42414664261849,119.91507434039295,,0,0,0,119.91507434039295
76,ALA,8.513405848784549,,0,0,0,8.513405848784549,4.329704076448552,,0,0,0,4.329704076448552,177.6051837320402,,0,0,0,177.6051837320402,52.419788767721165,,0,0,0,52.419788767721165,19.29810989939505,,0,0,0,19.29810989939505,127.26432748152403,,0,0,0,127.26432748152403
77,THR,8.339057421167722,,0,0,0,8.339057421167722,4.413013721281496,,0,0,0,4.413013721281496,174.5465739160395,,0,0,0,174.5465739160395,61.747152027811076,,0,0,0,61.747152027811076,69.87039836110556,,0,0,0,69.87039836110556,113.49502990992896,,0,0,0,113.49502990992896
78,ALA,8.3094640489677,,0,0,0,8.3094640489677,4.2230516941946945,,0,0,0,4.2230516941946945,177.64582558474305,,0,0,0,177.64582558474305,52.42301063568099,,0,0,0,52.42301063568099,19.065990142895995,,0,0,0,19.065990142895995,125.98790749486069,,0,0,0,125.98790749486069
79,ARG,8.302248576590078,,0,0,0,8.302248576590078,4.273556554484404,,0,0,0,4.273556554484404,175.65528451577313,,0,0,0,175.65528451577313,55.900136956915304,,0,0,0,55.900136956915304,30.772751126900875,,0,0,0,30.772751126900875,122.16118110521701,,0,0,0,122.16118110521701
80,VAL,8.139086883066932,,0,0,0,8.139086883066932,4.096599570068819,,0,0,0,4.096599570068819,176.2866159830503,,0,0,0,176.2866159830503,62.51117497120657,,0,0,0,62.51117497120657,32.66656586873682,,0,0,0,32.66656586873682,123.04425759049285,,0,0,0,123.04425759049285
81,MET,8.113176194921744,,0,0,0,8.113176194921744,4.295784477197802,,0,0,0,4.295784477197802,176.63144349571542,,0,0,0,176.63144349571542,56.298768090603836,,0,0,0,56.298768090603836,33.26580086275946,,0,0,0,33.26580086275946,126.2501477136086,,0,0,0,126.2501477136086
