RESNUM,RESNAME,H_X,H_Y,H_BEST_REF_SCORE,H_BEST_REF_COV,H_BEST_REF_MATCH,H_UCBShift,HA_X,HA_Y,HA_BEST_REF_SCORE,HA_BEST_REF_COV,HA_BEST_REF_MATCH,HA_UCBShift,C_X,C_Y,C_BEST_REF_SCORE,C_BEST_REF_COV,C_BEST_REF_MATCH,C_UCBShift,CA_X,CA_Y,CA_BEST_REF_SCORE,CA_BEST_REF_COV,CA_BEST_REF_MATCH,CA_UCBShift,CB_X,CB_Y,CB_BEST_REF_SCORE,CB_BEST_REF_COV,CB_BEST_REF_MATCH,CB_UCBShift,N_X,N_Y,N_BEST_REF_SCORE,N_BEST_REF_COV,N_BEST_REF_MATCH,N_UCBShift
1,MET,8.423980388095238,,0,0,0,8.423980388095238,4.373724034060384,,0,0,0,4.373724034060384,175.2132709716062,,0,0,0,175.2132709716062,55.7714532018315,,0,0,0,55.7714532018315,32.60825500564435,,0,0,0,32.60825500564435,121.5685718585248,,0,0,0,121.5685718585248
2,ALA,8.325788797186148,,0,0,0,8.325788797186148,4.229894195709846,,0,0,0,4.229894195709846,177.58248344162504,,0,0,0,177.58248344162504,52.06660542184482,,0,0,0,52.06660542184482,19.10347170972361,,0,0,0,19.10347170972361,126.05071346139415,,0,0,0,126.05071346139415
3,GLY,8.112544216300366,,0,0,0,8.112544216300366,3.856608353635254,,0,0,0,3.856608353635254,173.7111771498557,,0,0,0,173.7111771498557,44.82474183908869,,0,0,0,44.82474183908869,,,0,0,0,,110.32391550633255,,0,0,0,110.32391550633255
4,ASP,8.197625118009768,,0,0,0,8.197625118009768,4.774133351856477,,0,0,0,4.774133351856477,174.7686322692474,,0,0,0,174.7686322692474,52.063592066072815,,0,0,0,52.063592066072815,40.95186391315351,,0,0,0,40.95186391315351,122.89976439218005,,0,0,0,122.89976439218005
5,PRO,,,0,0,0,,4.380461109054834,,0,0,0,4.380461109054834,177.2010462341603,,0,0,0,177.2010462341603,63.13054074977245,,0,0,0,63.13054074977245,31.91961246713287,,0,0,0,31.91961246713287,,,0,0,0,
6,LEU,8.230430502275503,,0,0,0,8.230430502275503,4.430240555805305,,0,0,0,4.430240555805305,175.02548405516706,,0,0,0,175.02548405516706,52.99762603917749,,0,0,0,52.99762603917749,41.72155103963814,,0,0,0,41.72155103963814,124.13679293323342,,0,0,0,124.13679293323342
7,PRO,,,0,0,0,,4.255784639757465,,0,0,0,4.255784639757465,176.32703131275392,,0,0,0,176.32703131275392,62.81502493365523,,0,0,0,62.81502493365523,31.69779490884116,,0,0,0,31.69779490884116,,,0,0,0,
8,LYS,8.025418824913974,,0,0,0,8.025418824913974,3.799059882034632,,0,0,0,3.799059882034632,175.5715390079032,,0,0,0,175.5715390079032,55.96473011984127,,0,0,0,55.96473011984127,32.32860305942391,,0,0,0,32.32860305942391,122.25834313818405,,0,0,0,122.25834313818405
9,TYR,8.010204838172937,,0,0,0,8.010204838172937,4.32391521035076,,0,0,0,4.32391521035076,175.1259188653291,,0,0,0,175.1259188653291,57.445605609451654,,0,0,0,57.445605609451654,38.57945613739039,,0,0,0,38.57945613739039,122.57225134267955,,0,0,0,122.57225134267955
10,TRP,8.546466178010878,,0,0,0,8.546466178010878,4.810526933255634,,0,0,0,4.810526933255634,176.55812506465202,,0,0,0,176.55812506465202,57.352975846764345,,0,0,0,57.352975846764345,29.592616135631037,,0,0,0,29.592616135631037,125.14817055900211,,0,0,0,125.14817055900211
11,SER,8.683899535714286,,0,0,0,8.683899535714286,4.4258676501443,,0,0,0,4.4258676501443,174.57393496751027,,0,0,0,174.57393496751027,59.5995112082917,,0,0,0,59.5995112082917,63.660655155655455,,0,0,0,63.660655155655455,117.48351242646798,,0,0,0,117.48351242646798
12,TYR,8.02217997015762,,0,0,0,8.02217997015762,4.952275366944167,,0,0,0,4.952275366944167,174.62719454948385,,0,0,0,174.62719454948385,54.48681614433344,,0,0,0,54.48681614433344,38.77851831894772,,0,0,0,38.77851831894772,122.20847436522921,,0,0,0,122.20847436522921
13,PRO,,,0,0,0,,4.616407367338217,,0,0,0,4.616407367338217,176.2954810167666,,0,0,0,176.2954810167666,62.22450778610833,,0,0,0,62.22450778610833,32.61132723408814,,0,0,0,32.61132723408814,,,0,0,0,
14,VAL,8.24348347076257,,0,0,0,8.24348347076257,3.2748849600788104,,0,0,0,3.2748849600788104,177.25553867786104,,0,0,0,177.25553867786104,64.97052708466533,,0,0,0,64.97052708466533,31.713421023681875,,0,0,0,31.713421023681875,120.82709510129315,,0,0,0,120.82709510129315
15,GLY,8.810065986025087,,0,0,0,8.810065986025087,3.988728064230214,,0,0,0,3.988728064230214,174.21304347700078,,0,0,0,174.21304347700078,44.845974543545346,,0,0,0,44.845974543545346,,,0,0,0,,115.72325874739705,,0,0,0,115.72325874739705
16,LEU,7.908056763303364,,0,0,0,7.908056763303364,4.424243011222112,,0,0,0,4.424243011222112,175.5963621998557,,0,0,0,175.5963621998557,55.98735347913198,,0,0,0,55.98735347913198,42.53858170199245,,0,0,0,42.53858170199245,124.08584721780997,,0,0,0,124.08584721780997
17,ALA,8.488424220657121,,0,0,0,8.488424220657121,4.853140067848818,,0,0,0,4.853140067848818,177.20670965826952,,0,0,0,177.20670965826952,51.88752511366966,,0,0,0,51.88752511366966,19.15372146650017,,0,0,0,19.15372146650017,128.26748319626483,,0,0,0,128.26748319626483
18,VAL,9.020809956604506,,0,0,0,9.020809956604506,4.95081953126873,,0,0,0,4.95081953126873,173.2963183006438,,0,0,0,173.2963183006438,58.63274611844822,,0,0,0,58.63274611844822,35.30305469086469,,0,0,0,35.30305469086469,118.24432607214452,,0,0,0,118.24432607214452
19,GLU,8.832310821800421,,0,0,0,8.832310821800421,4.918264207020757,,0,0,0,4.918264207020757,175.81857308383837,,0,0,0,175.81857308383837,53.97558704798535,,0,0,0,53.97558704798535,32.73737078364968,,0,0,0,32.73737078364968,124.79940078667998,,0,0,0,124.79940078667998
20,ILE,9.069268896520146,,0,0,0,9.069268896520146,4.242841446969698,,0,0,0,4.242841446969698,175.89699681146632,,0,0,0,175.89699681146632,61.939066252958156,,0,0,0,61.939066252958156,37.96501158169608,,0,0,0,37.96501158169608,124.8044034829171,,0,0,0,124.8044034829171
21,ASN,9.00019495813076,,0,0,0,9.00019495813076,4.749636427389278,,0,0,0,4.749636427389278,175.85969144514928,,0,0,0,175.85969144514928,51.787668452930404,,0,0,0,51.787668452930404,39.330688654356756,,0,0,0,39.330688654356756,126.8594004954268,,0,0,0,126.8594004954268
22,ASN,8.717371346930847,,0,0,0,8.717371346930847,4.453336671167722,,0,0,0,4.453336671167722,177.00963130642688,,0,0,0,177.00963130642688,55.255588616300365,,0,0,0,55.255588616300365,38.28730105162615,,0,0,0,38.28730105162615,116.65526685008881,,0,0,0,116.65526685008881
23,ASN,8.322878351515152,,0,0,0,8.322878351515152,4.643777190187591,,0,0,0,4.643777190187591,176.3604726308691,,0,0,0,176.3604726308691,55.026660587778885,,0,0,0,55.026660587778885,38.238373493140195,,0,0,0,38.238373493140195,118.27441303538684,,0,0,0,118.27441303538684
24,ALA,7.970027722299922,,0,0,0,7.970027722299922,4.20505514013764,,0,0,0,4.20505514013764,178.05044041043956,,0,0,0,178.05044041043956,53.64008786410256,,0,0,0,53.64008786410256,18.885828993717396,,0,0,0,18.885828993717396,120.9952846996781,,0,0,0,120.9952846996781
25,ARG,7.800988235991786,,0,0,0,7.800988235991786,3.968423304678655,,0,0,0,3.968423304678655,176.96508959181375,,0,0,0,176.96508959181375,58.350178565750916,,0,0,0,58.350178565750916,29.588226653823952,,0,0,0,29.588226653823952,117.41965118070263,,0,0,0,117.41965118070263
26,TYR,7.745749176517926,,0,0,0,7.745749176517926,4.545245954040404,,0,0,0,4.545245954040404,176.67348499915641,,0,0,0,176.67348499915641,58.99532128458763,,0,0,0,58.99532128458763,38.31790543016983,,0,0,0,38.31790543016983,117.30632497304917,,0,0,0,117.30632497304917
27,GLY,8.0430237500666,,0,0,0,8.0430237500666,4.031621828904429,,0,0,0,4.031621828904429,174.49548915250307,,0,0,0,174.49548915250307,45.71426231829837,,0,0,0,45.71426231829837,,,0,0,0,,108.64615700395716,,0,0,0,108.64615700395716
28,CYS,8.303291593301145,,0,0,0,8.303291593301145,5.056729425740926,,0,0,0,5.056729425740926,173.01452831711066,,0,0,0,173.01452831711066,55.61991656242091,,0,0,0,55.61991656242091,28.210589331429684,,0,0,0,28.210589331429684,118.50794095062716,,0,0,0,118.50794095062716
29,PRO,,,0,0,0,,4.315094323029749,,0,0,0,4.315094323029749,178.9795267867022,,0,0,0,178.9795267867022,65.14459534055943,,0,0,0,65.14459534055943,31.394685121323125,,0,0,0,31.394685121323125,,,0,0,0,
30,HIS,8.541469285014985,,0,0,0,8.541469285014985,4.490742821489621,,0,0,0,4.490742821489621,175.63747441619492,,0,0,0,175.63747441619492,57.03941701979687,,0,0,0,57.03941701979687,29.265967094033744,,0,0,0,29.265967094033744,115.5356876454601,,0,0,0,115.5356876454601
31,HIS,8.132265767327118,,0,0,0,8.132265767327118,4.6718428273781765,,0,0,0,4.6718428273781765,175.2150239492563,,0,0,0,175.2150239492563,56.292940129925626,,0,0,0,56.292940129925626,31.104436585642137,,0,0,0,31.104436585642137,116.44905967328228,,0,0,0,116.44905967328228
32,VAL,7.244228199206349,,0,0,0,7.244228199206349,3.4982249665639915,,0,0,0,3.4982249665639915,177.5214335057387,,0,0,0,177.5214335057387,65.55087985295816,,0,0,0,65.55087985295816,30.890912735742035,,0,0,0,30.890912735742035,120.01594181627262,,0,0,0,120.01594181627262
33,GLY,9.000644486580086,,0,0,0,9.000644486580086,3.949417257581308,,0,0,0,3.949417257581308,174.79802632760573,,0,0,0,174.79802632760573,45.10738284031524,,0,0,0,45.10738284031524,,,0,0,0,,116.32421767963147,,0,0,0,116.32421767963147
34,ARG,8.123137885242535,,0,0,0,8.123137885242535,4.369576261699412,,0,0,0,4.369576261699412,175.1853437299534,,0,0,0,175.1853437299534,56.2096812062271,,0,0,0,56.2096812062271,31.280151418409368,,0,0,0,31.280151418409368,121.47221748732933,,0,0,0,121.47221748732933
35,LYS,8.538485697397046,,0,0,0,8.538485697397046,5.077189687384839,,0,0,0,5.077189687384839,176.1211512224886,,0,0,0,176.1211512224886,55.370400134465534,,0,0,0,55.370400134465534,34.58403206751027,,0,0,0,34.58403206751027,121.40372963902765,,0,0,0,121.40372963902765
36,GLY,8.934648306393607,,0,0,0,8.934648306393607,4.077830095973471,,0,0,0,4.077830095973471,171.92512650276944,,0,0,0,171.92512650276944,45.32453891854812,,0,0,0,45.32453891854812,,,0,0,0,,109.5857571653846,,0,0,0,109.5857571653846
37,LYS,8.95057501091131,,0,0,0,8.95057501091131,5.19206966960262,,0,0,0,5.19206966960262,175.73211164209678,,0,0,0,175.73211164209678,54.42040633745144,,0,0,0,54.42040633745144,35.75627431423577,,0,0,0,35.75627431423577,120.26061917625708,,0,0,0,120.26061917625708
38,ILE,8.820847690925742,,0,0,0,8.820847690925742,4.501042491336442,,0,0,0,4.501042491336442,177.06345896896437,,0,0,0,177.06345896896437,62.30290471472971,,0,0,0,62.30290471472971,37.51873638948274,,0,0,0,37.51873638948274,124.90050976817628,,0,0,0,124.90050976817628
39,ILE,8.977070102081251,,0,0,0,8.977070102081251,4.425394817735043,,0,0,0,4.425394817735043,176.06700746717726,,0,0,0,176.06700746717726,61.37856951717727,,0,0,0,61.37856951717727,39.16045195544456,,0,0,0,39.16045195544456,124.483389652997,,0,0,0,124.483389652997
40,GLU,7.838716298651349,,0,0,0,7.838716298651349,4.430705825097125,,0,0,0,4.430705825097125,174.4124941044067,,0,0,0,174.4124941044067,55.79436866386946,,0,0,0,55.79436866386946,33.16856002077922,,0,0,0,33.16856002077922,118.64010245866356,,0,0,0,118.64010245866356
41,HIS,8.7159496500333,,0,0,0,8.7159496500333,4.346827241541791,,0,0,0,4.346827241541791,174.79622350717617,,0,0,0,174.79622350717617,55.75765193654124,,0,0,0,55.75765193654124,29.869129221034523,,0,0,0,29.869129221034523,122.5253449413753,,0,0,0,122.5253449413753
42,LEU,8.723436550993451,,0,0,0,8.723436550993451,4.474824168914419,,0,0,0,4.474824168914419,176.84401103636364,,0,0,0,176.84401103636364,54.04429027644578,,0,0,0,54.04429027644578,42.18496050218115,,0,0,0,42.18496050218115,125.57362341542346,,0,0,0,125.57362341542346
43,HIS,8.600726068281718,,0,0,0,8.600726068281718,4.776704836768786,,0,0,0,4.776704836768786,175.1353637244866,,0,0,0,175.1353637244866,55.81628726269841,,0,0,0,55.81628726269841,29.747061015739817,,0,0,0,29.747061015739817,119.14352789188034,,0,0,0,119.14352789188034
44,SER,8.049423118764569,,0,0,0,8.049423118764569,4.593223727222777,,0,0,0,4.593223727222777,174.97840490739816,,0,0,0,174.97840490739816,57.88985754657564,,0,0,0,57.88985754657564,65.06880188602508,,0,0,0,65.06880188602508,115.36750172453658,,0,0,0,115.36750172453658
45,ALA,8.728496451703853,,0,0,0,8.728496451703853,4.198114047563548,,0,0,0,4.198114047563548,178.20937617038518,,0,0,0,178.20937617038518,54.18181969879565,,0,0,0,54.18181969879565,18.80131634913975,,0,0,0,18.80131634913975,127.89262065284716,,0,0,0,127.89262065284716
46,THR,7.890993936208236,,0,0,0,7.890993936208236,4.097735518731269,,0,0,0,4.097735518731269,173.91695241883116,,0,0,0,173.91695241883116,62.1497466565934,,0,0,0,62.1497466565934,69.5342261388001,,0,0,0,69.5342261388001,108.61472390240314,,0,0,0,108.61472390240314
47,TYR,7.451506191286491,,0,0,0,7.451506191286491,4.824372290254191,,0,0,0,4.824372290254191,174.48428485883005,,0,0,0,174.48428485883005,56.664560935597734,,0,0,0,56.664560935597734,41.273494313913865,,0,0,0,41.273494313913865,119.70334226308135,,0,0,0,119.70334226308135
48,ASP,8.741856327145078,,0,0,0,8.741856327145078,4.944021743045843,,0,0,0,4.944021743045843,176.4274222485126,,0,0,0,176.4274222485126,55.547901487307136,,0,0,0,55.547901487307136,43.735039563869464,,0,0,0,43.735039563869464,120.19928252131203,,0,0,0,120.19928252131203
49,TYR,8.974726852536351,,0,0,0,8.974726852536351,5.525203927999777,,0,0,0,5.525203927999777,174.69398181790987,,0,0,0,174.69398181790987,56.57897532417027,,0,0,0,56.57897532417027,42.91321025581085,,0,0,0,42.91321025581085,116.01360108586412,,0,0,0,116.01360108586412
50,ALA,9.204147260134311,,0,0,0,9.204147260134311,5.131277271284271,,0,0,0,5.131277271284271,175.6179931901432,,0,0,0,175.6179931901432,50.89857628936064,,0,0,0,50.89857628936064,20.09672955836941,,0,0,0,20.09672955836941,125.55887648053057,,0,0,0,125.55887648053057
51,VAL,9.211560256537906,,0,0,0,9.211560256537906,4.935871336335886,,0,0,0,4.935871336335886,174.46306791618937,,0,0,0,174.46306791618937,60.663469246337,,0,0,0,60.663469246337,34.56958024238539,,0,0,0,34.56958024238539,125.26069730352981,,0,0,0,125.26069730352981
52,SER,8.872248907259408,,0,0,0,8.872248907259408,5.227926323121323,,0,0,0,5.227926323121323,174.23959545824175,,0,0,0,174.23959545824175,56.45683907136752,,0,0,0,56.45683907136752,64.59931565132645,,0,0,0,64.59931565132645,121.82781877571873,,0,0,0,121.82781877571873
53,ASP,8.912909774037074,,0,0,0,8.912909774037074,5.141388169652569,,0,0,0,5.141388169652569,177.93188648512046,,0,0,0,177.93188648512046,52.59981272362637,,0,0,0,52.59981272362637,41.84463424355089,,0,0,0,41.84463424355089,126.79806206081142,,0,0,0,126.79806206081142
54,GLU,8.746500212387613,,0,0,0,8.746500212387613,4.200538080389055,,0,0,0,4.200538080389055,177.46104281310912,,0,0,0,177.46104281310912,58.51564045253635,,0,0,0,58.51564045253635,29.684803375424575,,0,0,0,29.684803375424575,117.31051909279054,,0,0,0,117.31051909279054
55,THR,7.936734647408148,,0,0,0,7.936734647408148,4.415944036205461,,0,0,0,4.415944036205461,175.92719279343987,,0,0,0,175.92719279343987,61.61470788654123,,0,0,0,61.61470788654123,69.8361679915862,,0,0,0,69.8361679915862,107.78243854461095,,0,0,0,107.78243854461095
56,GLY,8.0107132493895,,0,0,0,8.0107132493895,3.9961981421189914,,0,0,0,3.9961981421189914,174.24846271420802,,0,0,0,174.24846271420802,45.162591384049286,,0,0,0,45.162591384049286,,,0,0,0,,110.86598261933622,,0,0,0,110.86598261933622
57,ASP,8.009462406182706,,0,0,0,8.009462406182706,4.6075384456154955,,0,0,0,4.6075384456154955,175.17366701106673,,0,0,0,175.17366701106673,55.05142280539461,,0,0,0,55.05142280539461,41.51203986636697,,0,0,0,41.51203986636697,120.80042860575536,,0,0,0,120.80042860575536
58,ILE,8.2434744986458,,0,0,0,8.2434744986458,4.590225040154291,,0,0,0,4.590225040154291,175.6512565223055,,0,0,0,175.6512565223055,60.41075719159729,,0,0,0,60.41075719159729,38.6126726054945,,0,0,0,38.6126726054945,123.70906212638474,,0,0,0,123.70906212638474
59,THR,8.953448034648686,,0,0,0,8.953448034648686,4.305715151137751,,0,0,0,4.305715151137751,172.1288175043734,,0,0,0,172.1288175043734,60.26401015986791,,0,0,0,60.26401015986791,70.95161191344766,,0,0,0,70.95161191344766,121.56105248295037,,0,0,0,121.56105248295037
60,TYR,7.4947533857309345,,0,0,0,7.4947533857309345,5.338313126107226,,0,0,0,5.338313126107226,174.8874853485126,,0,0,0,174.8874853485126,56.605105556188256,,0,0,0,56.605105556188256,39.83401532479187,,0,0,0,39.83401532479187,123.42541940543344,,0,0,0,123.42541940543344
61,PHE,9.28268841843712,,0,0,0,9.28268841843712,5.08237771040071,,0,0,0,5.08237771040071,174.65463481746588,,0,0,0,174.65463481746588,56.461334892568544,,0,0,0,56.461334892568544,43.00805962094572,,0,0,0,43.00805962094572,120.35777948105228,,0,0,0,120.35777948105228
62,LYS,8.971830529048729,,0,0,0,8.971830529048729,4.632424657858808,,0,0,0,4.632424657858808,178.28430977319346,,0,0,0,178.28430977319346,55.68261422317683,,0,0,0,55.68261422317683,33.902883543711845,,0,0,0,33.902883543711845,119.91371466476302,,0,0,0,119.91371466476302
63,GLU,9.423130982212232,,0,0,0,9.423130982212232,4.066630221098347,,0,0,0,4.066630221098347,178.57881722208347,,0,0,0,178.57881722208347,60.30326207102897,,0,0,0,60.30326207102897,29.69659440941836,,0,0,0,29.69659440941836,122.73932821191586,,0,0,0,122.73932821191586
64,HIS,8.69745035946276,,0,0,0,8.69745035946276,4.436868558075258,,0,0,0,4.436868558075258,175.51286158163504,,0,0,0,175.51286158163504,57.78445207145077,,0,0,0,57.78445207145077,29.021592735847484,,0,0,0,29.021592735847484,112.90600352719503,,0,0,0,112.90600352719503
65,GLU,8.055133928660227,,0,0,0,8.055133928660227,4.54830163033078,,0,0,0,4.54830163033078,175.31399895182594,,0,0,0,175.31399895182594,57.24286585101565,,0,0,0,57.24286585101565,30.46348454152514,,0,0,0,30.46348454152514,119.9085934500666,,0,0,0,119.9085934500666
66,LEU,7.661466293034744,,0,0,0,7.661466293034744,4.972447406471306,,0,0,0,4.972447406471306,175.7866401591242,,0,0,0,175.7866401591242,53.571317046270394,,0,0,0,53.571317046270394,44.62928795439005,,0,0,0,44.62928795439005,119.01907090294151,,0,0,0,119.01907090294151
67,THR,8.894756716699966,,0,0,0,8.894756716699966,4.7742786723720725,,0,0,0,4.7742786723720725,172.26449693453768,,0,0,0,172.26449693453768,59.4314478538628,,0,0,0,59.4314478538628,70.82744487895992,,0,0,0,70.82744487895992,118.97549942485847,,0,0,0,118.97549942485847
68,PRO,,,0,0,0,,4.224337116761017,,0,0,0,4.224337116761017,176.84587901919193,,0,0,0,176.84587901919193,63.13415139292929,,0,0,0,63.13415139292929,31.90112670597181,,0,0,0,31.90112670597181,,,0,0,0,
69,LEU,8.41132792931513,,0,0,0,8.41132792931513,4.317966382520257,,0,0,0,4.317966382520257,177.43445677061825,,0,0,0,177.43445677061825,54.78628593346098,,0,0,0,54.78628593346098,42.17304578084138,,0,0,0,42.17304578084138,125.27439179634808,,0,0,0,125.27439179634808
70,LYS,8.675608889338438,,0,0,0,8.675608889338438,4.080031713339438,,0,0,0,4.080031713339438,177.46977056292042,,0,0,0,177.46977056292042,57.92083433006438,,0,0,0,57.92083433006438,32.12050131546787,,0,0,0,32.12050131546787,124.45054658764569,,0,0,0,124.45054658764569
71,GLY,8.854981295171495,,0,0,0,8.854981295171495,3.962506606013431,,0,0,0,3.962506606013431,175.26333453583084,,0,0,0,175.26333453583084,45.12624345575536,,0,0,0,45.12624345575536,,,0,0,0,,114.24928723637474,,0,0,0,114.24928723637474
72,GLY,8.214895474969476,,0,0,0,8.214895474969476,3.8984159192834946,,0,0,0,3.8984159192834946,174.10084330760907,,0,0,0,174.10084330760907,45.61926854441669,,0,0,0,45.61926854441669,,,0,0,0,,108.67546022355977,,0,0,0,108.67546022355977
73,LEU,7.904004612232212,,0,0,0,7.904004612232212,4.5254732107836615,,0,0,0,4.5254732107836615,177.43231391517372,,0,0,0,177.43231391517372,54.76329388162393,,0,0,0,54.76329388162393,41.62710695270285,,0,0,0,41.62710695270285,121.64088604082029,,0,0,0,121.64088604082029
74,ALA,8.193218094094794,,0,0,0,8.193218094094794,4.123411757026307,,0,0,0,4.123411757026307,176.8715822292652,,0,0,0,176.8715822292652,53.034268508386056,,0,0,0,53.034268508386056,19.17717158063603,,0,0,0,19.17717158063603,124.7316966536408,,0,0,0,124.7316966536408
75,TYR,7.712535616056165,,0,0,0,7.712535616056165,4.511466245718171,,0,0,0,4.511466245718171,175.6007487296648,,0,0,0,175.6007487296648,58.734385668054166,,0,0,0,58.734385668054166,38.638935399461644,,0,0,0,38.638935399461644,118.5283443563159,,0,0,0,118.5283443563159
76,VAL,7.974366957375957,,0,0,0,7.974366957375957,4.172048594738595,,0,0,0,4.172048594738595,175.80966341968033,,0,0,0,175.80966341968033,62.63556653571984,,0,0,0,62.63556653571984,32.56539546730492,,0,0,0,32.56539546730492,120.39532009824065,,0,0,0,120.39532009824065
77,LEU,8.168476597641249,,0,0,0,8.168476597641249,4.596181053701854,,0,0,0,4.596181053701854,177.11931331858142,,0,0,0,177.11931331858142,55.42868210098235,,0,0,0,55.42868210098235,42.36053588528139,,0,0,0,42.36053588528139,124.42238799551005,,0,0,0,124.42238799551005
78,GLU,8.26887056047841,,0,0,0,8.26887056047841,4.438487654845154,,0,0,0,4.438487654845154,176.26257293912198,,0,0,0,176.26257293912198,56.66269755098235,,0,0,0,56.66269755098235,30.298776054884005,,0,0,0,30.298776054884005,121.75948389654235,,0,0,0,121.75948389654235
79,HIS,8.460412307237208,,0,0,0,8.460412307237208,4.543388996769897,,0,0,0,4.543388996769897,174.13822391248195,,0,0,0,174.13822391248195,55.892084055211456,,0,0,0,55.892084055211456,28.884320314718614,,0,0,0,28.884320314718614,120.47346625432901,,0,0,0,120.47346625432901
80,HIS,8.276623443012543,,0,0,0,8.276623443012543,4.498552680425131,,0,0,0,4.498552680425131,174.10779282555222,,0,0,0,174.10779282555222,56.01622608880564,,0,0,0,56.01622608880564,28.798010782406482,,0,0,0,28.798010782406482,118.86702529720834,,0,0,0,118.86702529720834
81,HIS,8.235415427572427,,0,0,0,8.235415427572427,4.460960181840382,,0,0,0,4.460960181840382,173.9649725287435,,0,0,0,173.9649725287435,55.870896202619605,,0,0,0,55.870896202619605,29.130113485958486,,0,0,0,29.130113485958486,119.22879644061494,,0,0,0,119.22879644061494
82,HIS,8.217482874958375,,0,0,0,8.217482874958375,4.416203807942058,,0,0,0,4.416203807942058,173.871681461433,,0,0,0,173.871681461433,55.85943969616495,,0,0,0,55.85943969616495,29.172239355183706,,0,0,0,29.172239355183706,120.2154031054834,,0,0,0,120.2154031054834
83,HIS,8.20020800038295,,0,0,0,8.20020800038295,4.398241909229659,,0,0,0,4.398241909229659,173.93571977012988,,0,0,0,173.93571977012988,55.66645872937063,,0,0,0,55.66645872937063,30.75135966941392,,0,0,0,30.75135966941392,120.8784256049728,,0,0,0,120.8784256049728
84,HIS,8.171328896586747,,0,0,0,8.171328896586747,4.285749132345432,,0,0,0,4.285749132345432,175.3330018249972,,0,0,0,175.3330018249972,55.99166163964924,,0,0,0,55.99166163964924,30.02429552806638,,0,0,0,30.02429552806638,123.08888375298035,,0,0,0,123.08888375298035
