RESNUM,RESNAME,H_X,H_Y,H_BEST_REF_SCORE,H_BEST_REF_COV,H_BEST_REF_MATCH,H_UCBShift,HA_X,HA_Y,HA_BEST_REF_SCORE,HA_BEST_REF_COV,HA_BEST_REF_MATCH,HA_UCBShift,C_X,C_Y,C_BEST_REF_SCORE,C_BEST_REF_COV,C_BEST_REF_MATCH,C_UCBShift,CA_X,CA_Y,CA_BEST_REF_SCORE,CA_BEST_REF_COV,CA_BEST_REF_MATCH,CA_UCBShift,CB_X,CB_Y,CB_BEST_REF_SCORE,CB_BEST_REF_COV,CB_BEST_REF_MATCH,CB_UCBShift,N_X,N_Y,N_BEST_REF_SCORE,N_BEST_REF_COV,N_BEST_REF_MATCH,N_UCBShift
1,MET,8.326962144139193,,0,0,0,8.326962144139193,4.435867198878899,,0,0,0,4.435867198878899,175.5919203384782,,0,0,0,175.5919203384782,55.131767413431014,,0,0,0,55.131767413431014,32.90955934710845,,0,0,0,32.90955934710845,121.30952269832945,,0,0,0,121.30952269832945
2,SER,8.533321739377289,,0,0,0,8.533321739377289,4.451871124980575,,0,0,0,4.451871124980575,174.50069398835052,,0,0,0,174.50069398835052,58.015743306315905,,0,0,0,58.015743306315905,63.729266149778,,0,0,0,63.729266149778,118.5127003953491,,0,0,0,118.5127003953491
3,GLU,8.534232195532246,,0,0,0,8.534232195532246,4.24712619000444,,0,0,0,4.24712619000444,176.49771222111775,,0,0,0,176.49771222111775,56.36828147210567,,0,0,0,56.36828147210567,30.08958881208791,,0,0,0,30.08958881208791,123.10081486938063,,0,0,0,123.10081486938063
4,SER,8.41512841835942,,0,0,0,8.41512841835942,4.46439420014985,,0,0,0,4.46439420014985,175.48085763079698,,0,0,0,175.48085763079698,58.01629553129093,,0,0,0,58.01629553129093,64.05506688248973,,0,0,0,64.05506688248973,119.48108738510933,,0,0,0,119.48108738510933
5,ILE,8.567247614912864,,0,0,0,8.567247614912864,3.929998896964147,,0,0,0,3.929998896964147,177.02414348822288,,0,0,0,177.02414348822288,62.81866964170274,,0,0,0,62.81866964170274,37.65021716047286,,0,0,0,37.65021716047286,125.48343237629038,,0,0,0,125.48343237629038
6,VAL,7.771884157819957,,0,0,0,7.771884157819957,3.328404474911199,,0,0,0,3.328404474911199,177.43893948881674,,0,0,0,177.43893948881674,66.57990732693418,,0,0,0,66.57990732693418,31.467513114685318,,0,0,0,31.467513114685318,120.00199588183483,,0,0,0,120.00199588183483
7,THR,7.904544033322233,,0,0,0,7.904544033322233,3.8719886753968247,,0,0,0,3.8719886753968247,176.51912894915083,,0,0,0,176.51912894915083,66.32167594590965,,0,0,0,66.32167594590965,68.54006918064712,,0,0,0,68.54006918064712,115.94634272983127,,0,0,0,115.94634272983127
8,LYS,7.915177409046509,,0,0,0,7.915177409046509,4.061014311760462,,0,0,0,4.061014311760462,179.25339314778,,0,0,0,179.25339314778,59.37157609493284,,0,0,0,59.37157609493284,32.42090068769564,,0,0,0,32.42090068769564,122.72231727808304,,0,0,0,122.72231727808304
9,ILE,8.073376942735043,,0,0,0,8.073376942735043,3.5533672486569,,0,0,0,3.5533672486569,177.8275285752636,,0,0,0,177.8275285752636,65.97459932100676,,0,0,0,65.97459932100676,37.382054279209676,,0,0,0,37.382054279209676,120.35780264474415,,0,0,0,120.35780264474415
10,ILE,8.460624689688089,,0,0,0,8.460624689688089,3.424188757647909,,0,0,0,3.424188757647909,177.75086757344877,,0,0,0,177.75086757344877,66.01043366712732,,0,0,0,66.01043366712732,38.05629249193584,,0,0,0,38.05629249193584,119.91550099008214,,0,0,0,119.91550099008214
11,SER,8.16685473914974,,0,0,0,8.16685473914974,4.230644213974914,,0,0,0,4.230644213974914,177.31742292472526,,0,0,0,177.31742292472526,61.656429161116655,,0,0,0,61.656429161116655,63.046604055966256,,0,0,0,63.046604055966256,115.53645160726496,,0,0,0,115.53645160726496
12,ILE,8.075173353352204,,0,0,0,8.075173353352204,3.6672578302419807,,0,0,0,3.6672578302419807,177.58883586086137,,0,0,0,177.58883586086137,65.33926348374403,,0,0,0,65.33926348374403,38.131499242696194,,0,0,0,38.131499242696194,123.37669281175492,,0,0,0,123.37669281175492
13,VAL,8.54462726964702,,0,0,0,8.54462726964702,3.4618994622211128,,0,0,0,3.4618994622211128,177.85683470905207,,0,0,0,177.85683470905207,67.58747666411921,,0,0,0,67.58747666411921,31.42992961926407,,0,0,0,31.42992961926407,119.98881473642469,,0,0,0,119.98881473642469
14,GLN,8.439457694005995,,0,0,0,8.439457694005995,3.8840594565517823,,0,0,0,3.8840594565517823,177.92852682606838,,0,0,0,177.92852682606838,59.53205976542902,,0,0,0,59.53205976542902,28.47671283948829,,0,0,0,28.47671283948829,119.84230119096459,,0,0,0,119.84230119096459
15,GLU,8.2825921002442,,0,0,0,8.2825921002442,4.060776326717727,,0,0,0,4.060776326717727,179.39501936882561,,0,0,0,179.39501936882561,59.296196022344326,,0,0,0,59.296196022344326,29.55621318984904,,0,0,0,29.55621318984904,119.01086260618271,,0,0,0,119.01086260618271
16,ARG,8.209914777650129,,0,0,0,8.209914777650129,4.12335472035187,,0,0,0,4.12335472035187,179.16254166116107,,0,0,0,179.16254166116107,58.16016539521034,,0,0,0,58.16016539521034,29.9910910985348,,0,0,0,29.9910910985348,119.53347076335886,,0,0,0,119.53347076335886
17,GLN,8.573724225513375,,0,0,0,8.573724225513375,4.071616748912199,,0,0,0,4.071616748912199,178.48059228557,,0,0,0,178.48059228557,59.04603315201465,,0,0,0,59.04603315201465,28.710835042790542,,0,0,0,28.710835042790542,119.65116046715507,,0,0,0,119.65116046715507
18,ASN,8.115829288067488,,0,0,0,8.115829288067488,4.450949314690865,,0,0,0,4.450949314690865,177.5304130826229,,0,0,0,177.5304130826229,55.916023182695085,,0,0,0,55.916023182695085,38.467382818148515,,0,0,0,38.467382818148515,118.22861503969919,,0,0,0,118.22861503969919
19,MET,8.203107835631036,,0,0,0,8.203107835631036,4.249971565806415,,0,0,0,4.249971565806415,177.52194876461317,,0,0,0,177.52194876461317,57.69133801315906,,0,0,0,57.69133801315906,32.90753488948274,,0,0,0,32.90753488948274,118.32507065014984,,0,0,0,118.32507065014984
20,ASP,8.191860484615384,,0,0,0,8.191860484615384,4.755505810764236,,0,0,0,4.755505810764236,175.77750135748695,,0,0,0,175.77750135748695,54.228603890764795,,0,0,0,54.228603890764795,40.68300956721612,,0,0,0,40.68300956721612,117.69172335130426,,0,0,0,117.69172335130426
21,ASP,8.032797955250306,,0,0,0,8.032797955250306,4.322180767360417,,0,0,0,4.322180767360417,176.2035542015873,,0,0,0,176.2035542015873,55.285920321567325,,0,0,0,55.285920321567325,39.842924964041515,,0,0,0,39.842924964041515,119.35899512654568,,0,0,0,119.35899512654568
22,GLY,8.397754482695083,,0,0,0,8.397754482695083,3.9658411354201353,,0,0,0,3.9658411354201353,174.29246800093242,,0,0,0,174.29246800093242,45.54348389282384,,0,0,0,45.54348389282384,,,0,0,0,,105.60464123986013,,0,0,0,105.60464123986013
23,ALA,8.005704816228215,,0,0,0,8.005704816228215,4.423041847430348,,0,0,0,4.423041847430348,175.24992240452326,,0,0,0,175.24992240452326,50.826918537129536,,0,0,0,50.826918537129536,17.700408756243757,,0,0,0,17.700408756243757,125.57069996941392,,0,0,0,125.57069996941392
24,PRO,,,0,0,0,,4.53717227943723,,0,0,0,4.53717227943723,176.42765445912977,,0,0,0,176.42765445912977,62.76171221216561,,0,0,0,62.76171221216561,32.436624571350876,,0,0,0,32.436624571350876,,,0,0,0,
25,VAL,8.900233481146632,,0,0,0,8.900233481146632,4.498146814790765,,0,0,0,4.498146814790765,175.86796454899545,,0,0,0,175.86796454899545,61.46646768641359,,0,0,0,61.46646768641359,34.029335303940506,,0,0,0,34.029335303940506,121.92662917905427,,0,0,0,121.92662917905427
26,LYS,9.039149844649794,,0,0,0,9.039149844649794,4.859910302247752,,0,0,0,4.859910302247752,178.0579911974803,,0,0,0,178.0579911974803,56.15845343068043,,0,0,0,56.15845343068043,33.240533255305806,,0,0,0,33.240533255305806,127.46344954312355,,0,0,0,127.46344954312355
27,THR,9.07408045059385,,0,0,0,9.07408045059385,3.88338832988678,,0,0,0,3.88338832988678,175.99388459417804,,0,0,0,175.99388459417804,66.63320926754356,,0,0,0,66.63320926754356,68.71316852558553,,0,0,0,68.71316852558553,117.98983093052503,,0,0,0,117.98983093052503
28,ARG,8.528093267848819,,0,0,0,8.528093267848819,4.032342807348207,,0,0,0,4.032342807348207,177.97496854864025,,0,0,0,177.97496854864025,59.28188229499389,,0,0,0,59.28188229499389,29.599751679958928,,0,0,0,29.599751679958928,121.14770260147075,,0,0,0,121.14770260147075
29,ASP,7.858475416461316,,0,0,0,7.858475416461316,4.491906499839049,,0,0,0,4.491906499839049,179.0469243768121,,0,0,0,179.0469243768121,56.97834137262182,,0,0,0,56.97834137262182,40.720895900815854,,0,0,0,40.720895900815854,120.28313223266179,,0,0,0,120.28313223266179
30,ILE,8.246786997902097,,0,0,0,8.246786997902097,3.669385214751914,,0,0,0,3.669385214751914,177.87059436367522,,0,0,0,177.87059436367522,65.49250362614053,,0,0,0,65.49250362614053,38.12528311076701,,0,0,0,38.12528311076701,121.56397736098901,,0,0,0,121.56397736098901
31,ALA,8.401542682611833,,0,0,0,8.401542682611833,3.931811737076812,,0,0,0,3.931811737076812,179.49366103685205,,0,0,0,179.49366103685205,55.81132488013098,,0,0,0,55.81132488013098,18.165106059096463,,0,0,0,18.165106059096463,123.3747062008214,,0,0,0,123.3747062008214
32,ASP,8.381096379415029,,0,0,0,8.381096379415029,4.427411956476856,,0,0,0,4.427411956476856,178.90561774120326,,0,0,0,178.90561774120326,57.094995506604505,,0,0,0,57.094995506604505,40.75283432339327,,0,0,0,40.75283432339327,118.28857693325008,,0,0,0,118.28857693325008
33,ALA,7.997994383810633,,0,0,0,7.997994383810633,4.16312503991009,,0,0,0,4.16312503991009,179.19455371731047,,0,0,0,179.19455371731047,54.44401894005994,,0,0,0,54.44401894005994,18.38068468673549,,0,0,0,18.38068468673549,121.7827546994228,,0,0,0,121.7827546994228
34,ALA,8.177670031768232,,0,0,0,8.177670031768232,4.131005001751027,,0,0,0,4.131005001751027,178.61036565180376,,0,0,0,178.61036565180376,52.954494892718394,,0,0,0,52.954494892718394,19.523571594028198,,0,0,0,19.523571594028198,119.16498369476079,,0,0,0,119.16498369476079
35,GLY,7.973372511427462,,0,0,0,7.973372511427462,3.9518035654595396,,0,0,0,3.9518035654595396,175.2050275968587,,0,0,0,175.2050275968587,46.40875334684205,,0,0,0,46.40875334684205,,,0,0,0,,105.67021667721723,,0,0,0,105.67021667721723
36,LEU,8.055164105522255,,0,0,0,8.055164105522255,4.676048555894106,,0,0,0,4.676048555894106,177.0453049614108,,0,0,0,177.0453049614108,52.820461437778896,,0,0,0,52.820461437778896,43.939365123199025,,0,0,0,43.939365123199025,119.84241544479964,,0,0,0,119.84241544479964
37,SER,8.898846782933733,,0,0,0,8.898846782933733,4.53410364035964,,0,0,0,4.53410364035964,175.45072858064714,,0,0,0,175.45072858064714,57.609033717748915,,0,0,0,57.609033717748915,64.3590518655733,,0,0,0,64.3590518655733,115.83587206284271,,0,0,0,115.83587206284271
38,ILE,8.764353577494727,,0,0,0,8.764353577494727,3.8708739029359527,,0,0,0,3.8708739029359527,177.11495239537686,,0,0,0,177.11495239537686,64.3286783469697,,0,0,0,64.3286783469697,37.24670408924409,,0,0,0,37.24670408924409,122.88869700989567,,0,0,0,122.88869700989567
39,TYR,8.18828729068154,,0,0,0,8.18828729068154,4.0892442344988345,,0,0,0,4.0892442344988345,177.46263450591076,,0,0,0,177.46263450591076,61.01447153848929,,0,0,0,61.01447153848929,38.2223701998335,,0,0,0,38.2223701998335,120.38396472708958,,0,0,0,120.38396472708958
40,GLN,7.978104563730714,,0,0,0,7.978104563730714,3.8801130862026865,,0,0,0,3.8801130862026865,178.7141361103341,,0,0,0,178.7141361103341,58.712034210056615,,0,0,0,58.712034210056615,29.41067971032301,,0,0,0,29.41067971032301,119.92931719671994,,0,0,0,119.92931719671994
41,VAL,8.288495125979574,,0,0,0,8.288495125979574,3.5769488860667105,,0,0,0,3.5769488860667105,177.6137552323732,,0,0,0,177.6137552323732,67.00922287531911,,0,0,0,67.00922287531911,31.378353952375402,,0,0,0,31.378353952375402,119.9269314348929,,0,0,0,119.9269314348929
42,ARG,8.120378914912866,,0,0,0,8.120378914912866,3.7810700988677985,,0,0,0,3.7810700988677985,178.22970875818072,,0,0,0,178.22970875818072,60.011600796497945,,0,0,0,60.011600796497945,29.847518785597735,,0,0,0,29.847518785597735,120.45741856721057,,0,0,0,120.45741856721057
43,LEU,8.029523426517926,,0,0,0,8.029523426517926,3.89970995939061,,0,0,0,3.89970995939061,179.0946197563492,,0,0,0,179.0946197563492,57.75954970632146,,0,0,0,57.75954970632146,41.41023726202686,,0,0,0,41.41023726202686,119.287264950555,,0,0,0,119.287264950555
44,TYR,7.543819530103229,,0,0,0,7.543819530103229,4.348971005433455,,0,0,0,4.348971005433455,178.40874534006548,,0,0,0,178.40874534006548,61.391545159196355,,0,0,0,61.391545159196355,37.899462286552335,,0,0,0,37.899462286552335,118.84298485565546,,0,0,0,118.84298485565546
45,LEU,8.691343055006104,,0,0,0,8.691343055006104,3.5547252676295926,,0,0,0,3.5547252676295926,178.96516576799866,,0,0,0,178.96516576799866,58.01650284650905,,0,0,0,58.01650284650905,39.04095065988456,,0,0,0,39.04095065988456,120.81863132146742,,0,0,0,120.81863132146742
46,GLU,8.794597162609612,,0,0,0,8.794597162609612,4.043396592923743,,0,0,0,4.043396592923743,179.4913462917194,,0,0,0,179.4913462917194,59.99522297370962,,0,0,0,59.99522297370962,29.12165575124875,,0,0,0,29.12165575124875,119.98319198735153,,0,0,0,119.98319198735153
47,GLN,8.025546558236208,,0,0,0,8.025546558236208,4.127610786080586,,0,0,0,4.127610786080586,178.88025710954602,,0,0,0,178.88025710954602,58.758791542141196,,0,0,0,58.758791542141196,28.527035282084583,,0,0,0,28.527035282084583,119.97677782812187,,0,0,0,119.97677782812187
48,LEU,8.46624531132201,,0,0,0,8.46624531132201,4.118606335558885,,0,0,0,4.118606335558885,179.25456181023975,,0,0,0,179.25456181023975,57.34564455959041,,0,0,0,57.34564455959041,41.66442281882007,,0,0,0,41.66442281882007,120.5408470030969,,0,0,0,120.5408470030969
49,HIS,8.620149272077922,,0,0,0,8.620149272077922,4.790320842612942,,0,0,0,4.790320842612942,179.89588920725384,,0,0,0,179.89588920725384,59.443428688422685,,0,0,0,59.443428688422685,29.048721876379176,,0,0,0,29.048721876379176,119.75306315980686,,0,0,0,119.75306315980686
50,ASP,8.199767197741147,,0,0,0,8.199767197741147,4.421801555061605,,0,0,0,4.421801555061605,178.1545901277223,,0,0,0,178.1545901277223,56.81877222276612,,0,0,0,56.81877222276612,41.1005400979354,,0,0,0,41.1005400979354,122.0388988515873,,0,0,0,122.0388988515873
51,VAL,7.716426045809746,,0,0,0,7.716426045809746,4.38056516035076,,0,0,0,4.38056516035076,176.26799101797093,,0,0,0,176.26799101797093,61.371214884065935,,0,0,0,61.371214884065935,31.328797725829727,,0,0,0,31.328797725829727,109.7224682037629,,0,0,0,109.7224682037629
52,GLY,7.929164885952936,,0,0,0,7.929164885952936,3.98075143953269,,0,0,0,3.98075143953269,173.66055779223555,,0,0,0,173.66055779223555,46.2219387944389,,0,0,0,46.2219387944389,,,0,0,0,,108.52037393604174,,0,0,0,108.52037393604174
53,VAL,8.063654123371073,,0,0,0,8.063654123371073,4.055354058505383,,0,0,0,4.055354058505383,174.977354340787,,0,0,0,174.977354340787,64.13597697339883,,0,0,0,64.13597697339883,32.622425568270614,,0,0,0,32.622425568270614,120.75133425705961,,0,0,0,120.75133425705961
54,LEU,8.1381101495227,,0,0,0,8.1381101495227,5.259778883927185,,0,0,0,5.259778883927185,175.54129788907758,,0,0,0,175.54129788907758,52.96047692990343,,0,0,0,52.96047692990343,45.600696597824395,,0,0,0,45.600696597824395,118.97452988273393,,0,0,0,118.97452988273393
55,GLU,9.276119402725053,,0,0,0,9.276119402725053,4.794704406715507,,0,0,0,4.794704406715507,175.2952535574925,,0,0,0,175.2952535574925,54.35601117056277,,0,0,0,54.35601117056277,32.29852115503385,,0,0,0,32.29852115503385,121.81582161753802,,0,0,0,121.81582161753802
56,LYS,8.670375246947495,,0,0,0,8.670375246947495,4.046800607165057,,0,0,0,4.046800607165057,176.485889978305,,0,0,0,176.485889978305,55.14863416963037,,0,0,0,55.14863416963037,32.193756253002555,,0,0,0,32.193756253002555,126.5946674559385,,0,0,0,126.5946674559385
57,VAL,8.45215412103452,,0,0,0,8.45215412103452,3.839643187129537,,0,0,0,3.839643187129537,175.78494024277944,,0,0,0,175.78494024277944,63.206347325180374,,0,0,0,63.206347325180374,32.370747703146854,,0,0,0,32.370747703146854,125.16910066969142,,0,0,0,125.16910066969142
58,ASN,7.711460327711178,,0,0,0,7.711460327711178,4.874401101270951,,0,0,0,4.874401101270951,173.84707030554443,,0,0,0,173.84707030554443,52.594452716677765,,0,0,0,52.594452716677765,39.93227770745921,,0,0,0,39.93227770745921,119.40655227204462,,0,0,0,119.40655227204462
59,ALA,8.418783904706405,,0,0,0,8.418783904706405,4.397168391613942,,0,0,0,4.397168391613942,177.26607965797538,,0,0,0,177.26607965797538,52.333211731024534,,0,0,0,52.333211731024534,19.670454050677105,,0,0,0,19.670454050677105,126.00649226918081,,0,0,0,126.00649226918081
60,GLY,8.132571838023088,,0,0,0,8.132571838023088,4.019695412698413,,0,0,0,4.019695412698413,173.0262750564602,,0,0,0,173.0262750564602,45.0709558029082,,0,0,0,45.0709558029082,,,0,0,0,,110.64383288438783,,0,0,0,110.64383288438783
61,LYS,8.378165245143744,,0,0,0,8.378165245143744,4.198938321611721,,0,0,0,4.198938321611721,177.56270618184038,,0,0,0,177.56270618184038,57.49760762861583,,0,0,0,57.49760762861583,32.51232779674215,,0,0,0,32.51232779674215,121.99376275745367,,0,0,0,121.99376275745367
62,GLY,8.823656224214675,,0,0,0,8.823656224214675,3.955101231135531,,0,0,0,3.955101231135531,174.13414011275947,,0,0,0,174.13414011275947,45.39751438177378,,0,0,0,45.39751438177378,,,0,0,0,,111.34729206127206,,0,0,0,111.34729206127206
63,VAL,7.382273136430236,,0,0,0,7.382273136430236,4.323622487504163,,0,0,0,4.323622487504163,174.5354269888667,,0,0,0,174.5354269888667,59.78185487192807,,0,0,0,59.78185487192807,32.764275866428015,,0,0,0,32.764275866428015,119.28243687110113,,0,0,0,119.28243687110113
64,PRO,,,0,0,0,,4.514081543473194,,0,0,0,4.514081543473194,177.45625764674216,,0,0,0,177.45625764674216,62.82690249240204,,0,0,0,62.82690249240204,32.02430349077034,,0,0,0,32.02430349077034,,,0,0,0,
65,GLY,8.555817709457209,,0,0,0,8.555817709457209,3.80200855516428,,0,0,0,3.80200855516428,172.94849162178377,,0,0,0,172.94849162178377,45.754480322200024,,0,0,0,45.754480322200024,,,0,0,0,,112.05775223909423,,0,0,0,112.05775223909423
66,LEU,8.52707847005772,,0,0,0,8.52707847005772,4.9533807927905436,,0,0,0,4.9533807927905436,175.7637447192252,,0,0,0,175.7637447192252,53.73825031355312,,0,0,0,53.73825031355312,43.9849553003552,,0,0,0,43.9849553003552,126.24256847979242,,0,0,0,126.24256847979242
67,TRP,9.412956375552225,,0,0,0,9.412956375552225,5.514854849089799,,0,0,0,5.514854849089799,175.0907890077145,,0,0,0,175.0907890077145,55.8118302016539,,0,0,0,55.8118302016539,32.380414551137754,,0,0,0,32.380414551137754,122.11804357509712,,0,0,0,122.11804357509712
68,ARG,9.41011104041514,,0,0,0,9.41011104041514,4.948687458158509,,0,0,0,4.948687458158509,175.09442858476524,,0,0,0,175.09442858476524,54.45471613533133,,0,0,0,54.45471613533133,34.210027638750134,,0,0,0,34.210027638750134,122.60220388404373,,0,0,0,122.60220388404373
69,LEU,9.241933964879566,,0,0,0,9.241933964879566,4.528728710561661,,0,0,0,4.528728710561661,177.14151257402597,,0,0,0,177.14151257402597,55.75901155103785,,0,0,0,55.75901155103785,42.57727226486846,,0,0,0,42.57727226486846,126.55231289675879,,0,0,0,126.55231289675879
70,LEU,8.763394391458542,,0,0,0,8.763394391458542,4.533438973354423,,0,0,0,4.533438973354423,176.822626570424,,0,0,0,176.822626570424,54.27479880587191,,0,0,0,54.27479880587191,41.1697915521867,,0,0,0,41.1697915521867,127.0464194027417,,0,0,0,127.0464194027417
71,GLU,8.505404737318237,,0,0,0,8.505404737318237,4.246554609035409,,0,0,0,4.246554609035409,176.78757896892552,,0,0,0,176.78757896892552,57.38889460775336,,0,0,0,57.38889460775336,29.754869788672437,,0,0,0,29.754869788672437,122.40447889952826,,0,0,0,122.40447889952826
72,HIS,8.328868366772117,,0,0,0,8.328868366772117,4.532327511544012,,0,0,0,4.532327511544012,174.97316213497612,,0,0,0,174.97316213497612,56.65250433132978,,0,0,0,56.65250433132978,29.252389663436563,,0,0,0,29.252389663436563,117.85501548701853,,0,0,0,117.85501548701853
73,HIS,8.359027145637695,,0,0,0,8.359027145637695,4.7315020819069815,,0,0,0,4.7315020819069815,174.84390508372184,,0,0,0,174.84390508372184,56.03688748142968,,0,0,0,56.03688748142968,29.44625642126762,,0,0,0,29.44625642126762,117.3973432477356,,0,0,0,117.3973432477356
74,HIS,8.014621960900211,,0,0,0,8.014621960900211,4.427257315379065,,0,0,0,4.427257315379065,174.10978769830723,,0,0,0,174.10978769830723,55.4082126539405,,0,0,0,55.4082126539405,29.504524763059162,,0,0,0,29.504524763059162,118.95763738162948,,0,0,0,118.95763738162948
75,HIS,8.265189111166611,,0,0,0,8.265189111166611,4.419985190931291,,0,0,0,4.419985190931291,174.08671314687535,,0,0,0,174.08671314687535,55.73972444354534,,0,0,0,55.73972444354534,30.624274477039627,,0,0,0,30.624274477039627,120.00502797718949,,0,0,0,120.00502797718949
76,HIS,8.522701108580309,,0,0,0,8.522701108580309,4.432361086541236,,0,0,0,4.432361086541236,173.96399619053167,,0,0,0,173.96399619053167,55.72208987123432,,0,0,0,55.72208987123432,29.200571267388167,,0,0,0,29.200571267388167,121.24843758883894,,0,0,0,121.24843758883894
77,HIS,8.093695942224443,,0,0,0,8.093695942224443,4.341866003540904,,0,0,0,4.341866003540904,175.3375086037074,,0,0,0,175.3375086037074,55.88734906945277,,0,0,0,55.88734906945277,29.862191393339995,,0,0,0,29.862191393339995,121.61832853959373,,0,0,0,121.61832853959373
