RESNUM,RESNAME,H_X,H_Y,H_BEST_REF_SCORE,H_BEST_REF_COV,H_BEST_REF_MATCH,H_UCBShift,HA_X,HA_Y,HA_BEST_REF_SCORE,HA_BEST_REF_COV,HA_BEST_REF_MATCH,HA_UCBShift,C_X,C_Y,C_BEST_REF_SCORE,C_BEST_REF_COV,C_BEST_REF_MATCH,C_UCBShift,CA_X,CA_Y,CA_BEST_REF_SCORE,CA_BEST_REF_COV,CA_BEST_REF_MATCH,CA_UCBShift,CB_X,CB_Y,CB_BEST_REF_SCORE,CB_BEST_REF_COV,CB_BEST_REF_MATCH,CB_UCBShift,N_X,N_Y,N_BEST_REF_SCORE,N_BEST_REF_COV,N_BEST_REF_MATCH,N_UCBShift
1,MET,8.400916914701964,,0,0,0,8.400916914701964,4.50871050975136,,0,0,0,4.50871050975136,175.487673809768,,0,0,0,175.487673809768,55.55953797878232,,0,0,0,55.55953797878232,32.54300604371739,,0,0,0,32.54300604371739,121.2550942608225,,0,0,0,121.2550942608225
2,ASN,8.384792112065712,,0,0,0,8.384792112065712,4.910901480880232,,0,0,0,4.910901480880232,175.8372610650516,,0,0,0,175.8372610650516,53.728250841175495,,0,0,0,53.728250841175495,39.461426602797204,,0,0,0,39.461426602797204,119.2458851454046,,0,0,0,119.2458851454046
3,VAL,8.080447689410589,,0,0,0,8.080447689410589,3.793289793456543,,0,0,0,3.793289793456543,177.2810088044178,,0,0,0,177.2810088044178,65.7207901054501,,0,0,0,65.7207901054501,31.795718306177157,,0,0,0,31.795718306177157,121.1568812934066,,0,0,0,121.1568812934066
4,ASP,8.866938297863248,,0,0,0,8.866938297863248,4.498367308238983,,0,0,0,4.498367308238983,177.7279048274337,,0,0,0,177.7279048274337,56.673945281746036,,0,0,0,56.673945281746036,40.75244485771451,,0,0,0,40.75244485771451,120.69597313000888,,0,0,0,120.69597313000888
5,VAL,7.944632642657342,,0,0,0,7.944632642657342,3.7314391239954485,,0,0,0,3.7314391239954485,177.74253022240538,,0,0,0,177.74253022240538,66.0729816897547,,0,0,0,66.0729816897547,31.643744063270063,,0,0,0,31.643744063270063,118.63660197137862,,0,0,0,118.63660197137862
6,LYS,8.071781624603174,,0,0,0,8.071781624603174,3.863594645448995,,0,0,0,3.863594645448995,178.0298363616439,,0,0,0,178.0298363616439,60.27955501655567,,0,0,0,60.27955501655567,32.05872447043512,,0,0,0,32.05872447043512,119.78690352867133,,0,0,0,119.78690352867133
7,SER,8.139280775313576,,0,0,0,8.139280775313576,4.2866520257548,,0,0,0,4.2866520257548,176.96645514958928,,0,0,0,176.96645514958928,61.64422270557775,,0,0,0,61.64422270557775,62.96255286313686,,0,0,0,62.96255286313686,114.64370646467421,,0,0,0,114.64370646467421
8,ARG,8.124308591347543,,0,0,0,8.124308591347543,4.015187095682096,,0,0,0,4.015187095682096,178.93427911069486,,0,0,0,178.93427911069486,59.083545078216225,,0,0,0,59.083545078216225,30.168545624175824,,0,0,0,30.168545624175824,122.9374450003663,,0,0,0,122.9374450003663
9,ILE,8.188851266200466,,0,0,0,8.188851266200466,3.63085123121323,,0,0,0,3.63085123121323,177.78257186618382,,0,0,0,177.78257186618382,65.94827476872017,,0,0,0,65.94827476872017,38.010790659590405,,0,0,0,38.010790659590405,120.56134810148741,,0,0,0,120.56134810148741
10,MET,8.531301334171383,,0,0,0,8.531301334171383,4.4135537888389385,,0,0,0,4.4135537888389385,178.83240311128873,,0,0,0,178.83240311128873,56.95461978329448,,0,0,0,56.95461978329448,30.44227588984349,,0,0,0,30.44227588984349,119.4979421556277,,0,0,0,119.4979421556277
11,ASP,8.398896441042291,,0,0,0,8.398896441042291,4.447255216161616,,0,0,0,4.447255216161616,178.55462933634143,,0,0,0,178.55462933634143,57.1675940956932,,0,0,0,57.1675940956932,40.95908774542125,,0,0,0,40.95908774542125,121.4729721401654,,0,0,0,121.4729721401654
12,GLN,8.209599381185482,,0,0,0,8.209599381185482,4.217857225102675,,0,0,0,4.217857225102675,177.95461902970362,,0,0,0,177.95461902970362,58.64474062510823,,0,0,0,58.64474062510823,28.533422213764013,,0,0,0,28.533422213764013,119.86947726867577,,0,0,0,119.86947726867577
13,TYR,8.78922287948163,,0,0,0,8.78922287948163,4.317245108119658,,0,0,0,4.317245108119658,177.1514271963481,,0,0,0,177.1514271963481,61.23998075798646,,0,0,0,61.23998075798646,38.546635518004216,,0,0,0,38.546635518004216,120.75452987842712,,0,0,0,120.75452987842712
14,ALA,8.12533622993118,,0,0,0,8.12533622993118,3.7461921886502396,,0,0,0,3.7461921886502396,179.8722882857032,,0,0,0,179.8722882857032,54.58983672034632,,0,0,0,54.58983672034632,18.065689602353203,,0,0,0,18.065689602353203,121.24192591065601,,0,0,0,121.24192591065601
15,ASP,8.215812616489066,,0,0,0,8.215812616489066,4.427290993728493,,0,0,0,4.427290993728493,178.1747771073482,,0,0,0,178.1747771073482,56.54944403331113,,0,0,0,56.54944403331113,41.64598674497725,,0,0,0,41.64598674497725,118.59802394099789,,0,0,0,118.59802394099789
16,TRP,8.493644967476968,,0,0,0,8.493644967476968,4.470203637018537,,0,0,0,4.470203637018537,176.1232858756854,,0,0,0,176.1232858756854,58.32863114153624,,0,0,0,58.32863114153624,30.113354702935954,,0,0,0,30.113354702935954,116.57563951774337,,0,0,0,116.57563951774337
17,LYS,7.844183033788433,,0,0,0,7.844183033788433,3.710637118703519,,0,0,0,3.710637118703519,177.7733352610445,,0,0,0,177.7733352610445,58.89182006467977,,0,0,0,58.89182006467977,31.53109640638806,,0,0,0,31.53109640638806,122.93782869746364,,0,0,0,122.93782869746364
18,GLY,9.017757119147518,,0,0,0,9.017757119147518,3.8985473341713845,,0,0,0,3.8985473341713845,174.41689530856365,,0,0,0,174.41689530856365,45.49032694819625,,0,0,0,45.49032694819625,,,0,0,0,,114.45317848896104,,0,0,0,114.45317848896104
19,VAL,7.996495235991786,,0,0,0,7.996495235991786,3.874397527256077,,0,0,0,3.874397527256077,175.7569806952825,,0,0,0,175.7569806952825,63.857797583177934,,0,0,0,63.857797583177934,31.84129284906205,,0,0,0,31.84129284906205,122.92164453240093,,0,0,0,122.92164453240093
20,ARG,8.3087825489899,,0,0,0,8.3087825489899,4.33768468069153,,0,0,0,4.33768468069153,175.9984656958375,,0,0,0,175.9984656958375,55.99663569095349,,0,0,0,55.99663569095349,30.90567016974692,,0,0,0,30.90567016974692,126.54461887238872,,0,0,0,126.54461887238872
21,TYR,8.581240648823398,,0,0,0,8.581240648823398,4.841121077705628,,0,0,0,4.841121077705628,175.55081981154956,,0,0,0,175.55081981154956,59.164282697913194,,0,0,0,59.164282697913194,39.10231619058719,,0,0,0,39.10231619058719,123.35867422889888,,0,0,0,123.35867422889888
22,ARG,7.903157747413698,,0,0,0,7.903157747413698,4.468710832017982,,0,0,0,4.468710832017982,174.65059057822734,,0,0,0,174.65059057822734,55.11920208757908,,0,0,0,55.11920208757908,32.358426404956155,,0,0,0,32.358426404956155,129.09803461960817,,0,0,0,129.09803461960817
23,LEU,8.537372057048508,,0,0,0,8.537372057048508,3.798264757101232,,0,0,0,3.798264757101232,178.40504822046842,,0,0,0,178.40504822046842,56.82308032242202,,0,0,0,56.82308032242202,41.61096144623154,,0,0,0,41.61096144623154,128.30021902822733,,0,0,0,128.30021902822733
24,GLY,8.933312473981575,,0,0,0,8.933312473981575,3.9711835906343653,,0,0,0,3.9711835906343653,175.12298223781775,,0,0,0,175.12298223781775,45.4903899491675,,0,0,0,45.4903899491675,,,0,0,0,,114.40513185021089,,0,0,0,114.40513185021089
25,GLY,8.144754803746254,,0,0,0,8.144754803746254,4.039328016422467,,0,0,0,4.039328016422467,173.67465296166057,,0,0,0,173.67465296166057,45.18576364051504,,0,0,0,45.18576364051504,,,0,0,0,,110.10816157641247,,0,0,0,110.10816157641247
26,SER,8.443269443706294,,0,0,0,8.443269443706294,4.727990957853258,,0,0,0,4.727990957853258,173.27313552474746,,0,0,0,173.27313552474746,57.69762969355089,,0,0,0,57.69762969355089,65.01330673457653,,0,0,0,65.01330673457653,114.52412409164725,,0,0,0,114.52412409164725
27,THR,8.268781784432235,,0,0,0,8.268781784432235,5.046845602009102,,0,0,0,5.046845602009102,175.59308798724052,,0,0,0,175.59308798724052,60.228324330186474,,0,0,0,60.228324330186474,71.62160325776446,,0,0,0,71.62160325776446,113.66720262752803,,0,0,0,113.66720262752803
28,LYS,8.751106517105116,,0,0,0,8.751106517105116,3.902281945365745,,0,0,0,3.902281945365745,177.54867558736262,,0,0,0,177.54867558736262,58.64424304439449,,0,0,0,58.64424304439449,31.919392534415586,,0,0,0,31.919392534415586,119.58310420658786,,0,0,0,119.58310420658786
29,LYS,8.005564724186923,,0,0,0,8.005564724186923,4.2910372415473415,,0,0,0,4.2910372415473415,176.21390834890664,,0,0,0,176.21390834890664,57.081752350888,,0,0,0,57.081752350888,32.68470292633478,,0,0,0,32.68470292633478,116.63071068371073,,0,0,0,116.63071068371073
30,GLY,8.050536911127761,,0,0,0,8.050536911127761,4.225501212257187,,0,0,0,4.225501212257187,171.77806061688312,,0,0,0,171.77806061688312,45.78369107031857,,0,0,0,45.78369107031857,,,0,0,0,,108.38218622932622,,0,0,0,108.38218622932622
31,ILE,8.577892080402929,,0,0,0,8.577892080402929,4.67539546000666,,0,0,0,4.67539546000666,174.08390097372072,,0,0,0,174.08390097372072,59.90339001758797,,0,0,0,59.90339001758797,42.17835698726274,,0,0,0,42.17835698726274,120.65158070592186,,0,0,0,120.65158070592186
32,ASP,8.485511395410144,,0,0,0,8.485511395410144,4.3045610025030525,,0,0,0,4.3045610025030525,176.59281580412366,,0,0,0,176.59281580412366,52.61201592718948,,0,0,0,52.61201592718948,42.54492913851704,,0,0,0,42.54492913851704,123.594063253108,,0,0,0,123.594063253108
33,CYS,9.025611277566878,,0,0,0,9.025611277566878,4.123704351148851,,0,0,0,4.123704351148851,176.09619239679765,,0,0,0,176.09619239679765,61.978005966183815,,0,0,0,61.978005966183815,27.523219738911088,,0,0,0,27.523219738911088,117.8903174647186,,0,0,0,117.8903174647186
34,SER,8.211954486702187,,0,0,0,8.211954486702187,4.33728620538628,,0,0,0,4.33728620538628,176.90873542309356,,0,0,0,176.90873542309356,61.303972662282156,,0,0,0,61.303972662282156,62.39415621395271,,0,0,0,62.39415621395271,115.78739826717727,,0,0,0,115.78739826717727
35,GLY,9.019709577528026,,0,0,0,9.019709577528026,3.7563882405150406,,0,0,0,3.7563882405150406,175.59578978350538,,0,0,0,175.59578978350538,47.18114890835276,,0,0,0,47.18114890835276,,,0,0,0,,111.53157784421134,,0,0,0,111.53157784421134
36,PHE,8.883861353729603,,0,0,0,8.883861353729603,3.769661007231657,,0,0,0,3.769661007231657,177.6346204242924,,0,0,0,177.6346204242924,62.03264091699412,,0,0,0,62.03264091699412,39.30334534764125,,0,0,0,39.30334534764125,123.60607175376845,,0,0,0,123.60607175376845
37,VAL,8.66526194170274,,0,0,0,8.66526194170274,3.412263668820069,,0,0,0,3.412263668820069,177.22635187090688,,0,0,0,177.22635187090688,67.17811913724609,,0,0,0,67.17811913724609,31.75325187949828,,0,0,0,31.75325187949828,121.53686389633145,,0,0,0,121.53686389633145
38,GLN,8.663994901504052,,0,0,0,8.663994901504052,3.881851550235875,,0,0,0,3.881851550235875,177.7742439498224,,0,0,0,177.7742439498224,59.55816128960484,,0,0,0,59.55816128960484,28.806286851776,,0,0,0,28.806286851776,119.82569596276501,,0,0,0,119.82569596276501
39,ARG,8.27882453009213,,0,0,0,8.27882453009213,3.948665246245421,,0,0,0,3.948665246245421,178.12865539287935,,0,0,0,178.12865539287935,58.84710870053835,,0,0,0,58.84710870053835,29.965292546442445,,0,0,0,29.965292546442445,118.19237433925518,,0,0,0,118.19237433925518
40,THR,8.151653040265291,,0,0,0,8.151653040265291,3.77517050043845,,0,0,0,3.77517050043845,176.4120237271062,,0,0,0,176.4120237271062,67.24622614998334,,0,0,0,67.24622614998334,68.33916963416583,,0,0,0,68.33916963416583,118.67722137359307,,0,0,0,118.67722137359307
41,PHE,8.811369991269842,,0,0,0,8.811369991269842,4.012191717060717,,0,0,0,4.012191717060717,178.65077345824176,,0,0,0,178.65077345824176,62.94592383989899,,0,0,0,62.94592383989899,39.09484126792097,,0,0,0,39.09484126792097,120.69344723483738,,0,0,0,120.69344723483738
42,ARG,8.418864581662781,,0,0,0,8.418864581662781,4.09609956991342,,0,0,0,4.09609956991342,179.5467776875347,,0,0,0,179.5467776875347,59.485703393695196,,0,0,0,59.485703393695196,30.12616574055389,,0,0,0,30.12616574055389,121.37690747448663,,0,0,0,121.37690747448663
43,GLU,8.39377436885337,,0,0,0,8.39377436885337,4.127886086596737,,0,0,0,4.127886086596737,178.42676481288154,,0,0,0,178.42676481288154,58.82464321960817,,0,0,0,58.82464321960817,30.005545946797646,,0,0,0,30.005545946797646,117.5571374516539,,0,0,0,117.5571374516539
44,GLN,8.110809612509712,,0,0,0,8.110809612509712,4.072026805744256,,0,0,0,4.072026805744256,176.86469901534022,,0,0,0,176.86469901534022,56.962171471139975,,0,0,0,56.962171471139975,29.89669437106227,,0,0,0,29.89669437106227,115.4474854037407,,0,0,0,115.4474854037407
45,PHE,7.845478871228772,,0,0,0,7.845478871228772,4.528509906920856,,0,0,0,4.528509906920856,176.17195558671884,,0,0,0,176.17195558671884,57.81329285881341,,0,0,0,57.81329285881341,41.21971324570985,,0,0,0,41.21971324570985,113.83269377716728,,0,0,0,113.83269377716728
46,GLY,7.777367416333666,,0,0,0,7.777367416333666,3.934621531379732,,0,0,0,3.934621531379732,174.4302467940837,,0,0,0,174.4302467940837,46.333029944239094,,0,0,0,46.333029944239094,,,0,0,0,,108.83369972873237,,0,0,0,108.83369972873237
47,LEU,8.176856663431014,,0,0,0,8.176856663431014,4.453458827822178,,0,0,0,4.453458827822178,175.90185438248417,,0,0,0,175.90185438248417,53.948096917898766,,0,0,0,53.948096917898766,42.95116955911866,,0,0,0,42.95116955911866,122.42972508512598,,0,0,0,122.42972508512598
48,GLU,8.527534297735597,,0,0,0,8.527534297735597,4.346148604165279,,0,0,0,4.346148604165279,175.59025904703628,,0,0,0,175.59025904703628,56.566430303252304,,0,0,0,56.566430303252304,29.706199865612163,,0,0,0,29.706199865612163,125.1270143516761,,0,0,0,125.1270143516761
49,LEU,8.38010353912199,,0,0,0,8.38010353912199,4.814500255833056,,0,0,0,4.814500255833056,175.07329997892663,,0,0,0,175.07329997892663,52.240603516444665,,0,0,0,52.240603516444665,42.11464005764236,,0,0,0,42.11464005764236,125.0212424101787,,0,0,0,125.0212424101787
50,PRO,,,0,0,0,,4.500828760361861,,0,0,0,4.500828760361861,176.302536657659,,0,0,0,176.302536657659,62.50566097084582,,0,0,0,62.50566097084582,32.51627395053835,,0,0,0,32.51627395053835,,,0,0,0,
51,ARG,8.515884044483295,,0,0,0,8.515884044483295,4.131703562176712,,0,0,0,4.131703562176712,176.91906399689202,,0,0,0,176.91906399689202,58.0128287032301,,0,0,0,58.0128287032301,30.866331427738928,,0,0,0,30.866331427738928,120.61576648175158,,0,0,0,120.61576648175158
52,SER,8.139209064374516,,0,0,0,8.139209064374516,4.794498407437008,,0,0,0,4.794498407437008,175.57182678302252,,0,0,0,175.57182678302252,56.98111414086469,,0,0,0,56.98111414086469,64.99236116528472,,0,0,0,64.99236116528472,113.1484344334388,,0,0,0,113.1484344334388
53,THR,9.111376734526585,,0,0,0,9.111376734526585,3.8933888547064046,,0,0,0,3.8933888547064046,175.7679668006438,,0,0,0,175.7679668006438,65.5275352065379,,0,0,0,65.5275352065379,68.05661268009213,,0,0,0,68.05661268009213,117.40592877740038,,0,0,0,117.40592877740038
54,TYR,8.30575821944167,,0,0,0,8.30575821944167,4.033187477636253,,0,0,0,4.033187477636253,176.81147906970253,,0,0,0,176.81147906970253,60.992160910639356,,0,0,0,60.992160910639356,38.34040546642802,,0,0,0,38.34040546642802,122.34290826002885,,0,0,0,122.34290826002885
55,GLU,8.50642411081141,,0,0,0,8.50642411081141,3.8356014943667454,,0,0,0,3.8356014943667454,179.53215659297925,,0,0,0,179.53215659297925,59.267033020646025,,0,0,0,59.267033020646025,29.64181551993007,,0,0,0,29.64181551993007,119.07918507355423,,0,0,0,119.07918507355423
56,GLN,8.400292898001998,,0,0,0,8.400292898001998,3.8888106695471194,,0,0,0,3.8888106695471194,177.93115838806747,,0,0,0,177.93115838806747,58.78906225000556,,0,0,0,58.78906225000556,28.95779669121434,,0,0,0,28.95779669121434,119.17859258400487,,0,0,0,119.17859258400487
57,GLN,7.627389785747585,,0,0,0,7.627389785747585,3.9684380574758573,,0,0,0,3.9684380574758573,177.2063785614996,,0,0,0,177.2063785614996,58.09347636066711,,0,0,0,58.09347636066711,28.508058664557666,,0,0,0,28.508058664557666,116.52580773121878,,0,0,0,116.52580773121878
58,GLU,7.497075633982684,,0,0,0,7.497075633982684,4.097043682781108,,0,0,0,4.097043682781108,176.85946092058498,,0,0,0,176.85946092058498,57.149337804062604,,0,0,0,57.149337804062604,30.035781316095015,,0,0,0,30.035781316095015,117.44899056169386,,0,0,0,117.44899056169386
59,MET,7.424610798795649,,0,0,0,7.424610798795649,4.300235464205239,,0,0,0,4.300235464205239,176.15770503095794,,0,0,0,176.15770503095794,55.12632200356865,,0,0,0,55.12632200356865,33.420134787251634,,0,0,0,33.420134787251634,118.78770940230879,,0,0,0,118.78770940230879
60,GLY,8.220766174164725,,0,0,0,8.220766174164725,3.872508731365856,,0,0,0,3.872508731365856,173.29868923367744,,0,0,0,173.29868923367744,45.00273999110889,,0,0,0,45.00273999110889,,,0,0,0,,108.70141140941281,,0,0,0,108.70141140941281
61,LYS,8.457936043833943,,0,0,0,8.457936043833943,4.615004017976468,,0,0,0,4.615004017976468,176.00193825365744,,0,0,0,176.00193825365744,54.69760156237096,,0,0,0,54.69760156237096,34.55459088264514,,0,0,0,34.55459088264514,120.73163760729827,,0,0,0,120.73163760729827
62,SER,8.60601902791653,,0,0,0,8.60601902791653,4.54782683001443,,0,0,0,4.54782683001443,174.00480273747917,,0,0,0,174.00480273747917,58.74665522659007,,0,0,0,58.74665522659007,63.7653189558386,,0,0,0,63.7653189558386,119.84122466855368,,0,0,0,119.84122466855368
63,VAL,8.78540254094239,,0,0,0,8.78540254094239,4.4928386455377955,,0,0,0,4.4928386455377955,175.03016763330558,,0,0,0,175.03016763330558,61.13985386100566,,0,0,0,61.13985386100566,34.90653834119769,,0,0,0,34.90653834119769,125.54170181063937,,0,0,0,125.54170181063937
64,SER,8.66835514953935,,0,0,0,8.66835514953935,4.5090489486735486,,0,0,0,4.5090489486735486,175.5521631907981,,0,0,0,175.5521631907981,58.21512107172827,,0,0,0,58.21512107172827,64.18506544089799,,0,0,0,64.18506544089799,120.99947206490731,,0,0,0,120.99947206490731
65,ARG,8.783635425352426,,0,0,0,8.783635425352426,3.8026960907786655,,0,0,0,3.8026960907786655,178.2344829768565,,0,0,0,178.2344829768565,58.951499698606945,,0,0,0,58.951499698606945,29.783872317526917,,0,0,0,29.783872317526917,125.34983820585526,,0,0,0,125.34983820585526
66,SER,8.322354671811523,,0,0,0,8.322354671811523,4.194481470215895,,0,0,0,4.194481470215895,175.2563154003663,,0,0,0,175.2563154003663,59.75463332963148,,0,0,0,59.75463332963148,62.74821124517149,,0,0,0,62.74821124517149,112.23397968095239,,0,0,0,112.23397968095239
67,ASN,7.783477088117438,,0,0,0,7.783477088117438,4.826679555178155,,0,0,0,4.826679555178155,175.24100643810078,,0,0,0,175.24100643810078,52.92694368090243,,0,0,0,52.92694368090243,39.492334764169165,,0,0,0,39.492334764169165,119.1334173062271,,0,0,0,119.1334173062271
68,LEU,7.13081598996004,,0,0,0,7.13081598996004,4.01003155922966,,0,0,0,4.01003155922966,176.48490091748252,,0,0,0,176.48490091748252,55.74983352469752,,0,0,0,55.74983352469752,41.48853927636252,,0,0,0,41.48853927636252,120.7334512473804,,0,0,0,120.7334512473804
69,ARG,8.785366296492398,,0,0,0,8.785366296492398,4.786909176340326,,0,0,0,4.786909176340326,175.95071782022424,,0,0,0,175.95071782022424,54.11766547187812,,0,0,0,54.11766547187812,32.95238516479632,,0,0,0,32.95238516479632,121.52269595604396,,0,0,0,121.52269595604396
70,THR,8.616364004345655,,0,0,0,8.616364004345655,4.046344533954933,,0,0,0,4.046344533954933,175.92050129375068,,0,0,0,175.92050129375068,64.90653516894217,,0,0,0,64.90653516894217,68.93245452877677,,0,0,0,68.93245452877677,117.81021463393273,,0,0,0,117.81021463393273
71,GLY,9.179201738800089,,0,0,0,9.179201738800089,3.926988592118992,,0,0,0,3.926988592118992,173.2650622428516,,0,0,0,173.2650622428516,45.21040263803974,,0,0,0,45.21040263803974,,,0,0,0,,114.98017369524919,,0,0,0,114.98017369524919
72,ASP,8.484574042468642,,0,0,0,8.484574042468642,4.787851181063381,,0,0,0,4.787851181063381,176.25056682983683,,0,0,0,176.25056682983683,55.56428938374958,,0,0,0,55.56428938374958,40.9559767016761,,0,0,0,40.9559767016761,122.77953771620602,,0,0,0,122.77953771620602
73,LEU,8.842873816588968,,0,0,0,8.842873816588968,5.111847323914974,,0,0,0,5.111847323914974,176.3276259211233,,0,0,0,176.3276259211233,54.82627528899989,,0,0,0,54.82627528899989,42.88200698222333,,0,0,0,42.88200698222333,122.12298906249306,,0,0,0,122.12298906249306
74,VAL,9.242595013758464,,0,0,0,9.242595013758464,4.604501984060384,,0,0,0,4.604501984060384,174.05884306044513,,0,0,0,174.05884306044513,60.9511146450605,,0,0,0,60.9511146450605,33.163693985153735,,0,0,0,33.163693985153735,121.27591532708958,,0,0,0,121.27591532708958
75,LEU,8.742434206510158,,0,0,0,8.742434206510158,5.274957932484184,,0,0,0,5.274957932484184,174.86947220936287,,0,0,0,174.86947220936287,52.40896967150072,,0,0,0,52.40896967150072,43.8047765034854,,0,0,0,43.8047765034854,127.26055125764236,,0,0,0,127.26055125764236
76,PHE,9.525602550743702,,0,0,0,9.525602550743702,5.209767721767121,,0,0,0,5.209767721767121,175.6526512338939,,0,0,0,175.6526512338939,56.35142155790876,,0,0,0,56.35142155790876,42.7470554528194,,0,0,0,42.7470554528194,119.76763241409147,,0,0,0,119.76763241409147
77,ARG,8.81745969978355,,0,0,0,8.81745969978355,4.838642671517372,,0,0,0,4.838642671517372,175.06259070243092,,0,0,0,175.06259070243092,56.12257359907315,,0,0,0,56.12257359907315,29.009899219402822,,0,0,0,29.009899219402822,123.00922823868909,,0,0,0,123.00922823868909
78,ALA,7.900260434593185,,0,0,0,7.900260434593185,4.464187896331446,,0,0,0,4.464187896331446,176.67974569354536,,0,0,0,176.67974569354536,51.73432005994561,,0,0,0,51.73432005994561,21.445067546298148,,0,0,0,21.445067546298148,123.4498698946054,,0,0,0,123.4498698946054
79,GLY,8.48537372942613,,0,0,0,8.48537372942613,4.094159640556666,,0,0,0,4.094159640556666,175.39701009852925,,0,0,0,175.39701009852925,44.95954435208125,,0,0,0,44.95954435208125,,,0,0,0,,107.48281052498058,,0,0,0,107.48281052498058
80,SER,8.76377830913531,,0,0,0,8.76377830913531,4.315708855883006,,0,0,0,4.315708855883006,175.65103066867576,,0,0,0,175.65103066867576,60.71543862848817,,0,0,0,60.71543862848817,62.803661796830944,,0,0,0,62.803661796830944,115.9989954593462,,0,0,0,115.9989954593462
81,THR,7.676254848035298,,0,0,0,7.676254848035298,4.451611772730048,,0,0,0,4.451611772730048,175.8138110043845,,0,0,0,175.8138110043845,61.549932968831165,,0,0,0,61.549932968831165,69.61202529318459,,0,0,0,69.61202529318459,110.17640802138416,,0,0,0,110.17640802138416
82,GLY,8.13753812985348,,0,0,0,8.13753812985348,3.986147478257853,,0,0,0,3.986147478257853,173.36310838026972,,0,0,0,173.36310838026972,45.9040307971584,,0,0,0,45.9040307971584,,,0,0,0,,111.87724194248528,,0,0,0,111.87724194248528
83,ARG,7.9882122331501835,,0,0,0,7.9882122331501835,5.113800402042402,,0,0,0,5.113800402042402,175.1355584717727,,0,0,0,175.1355584717727,54.934038824336774,,0,0,0,54.934038824336774,33.163014568770116,,0,0,0,33.163014568770116,119.30311766539572,,0,0,0,119.30311766539572
84,HIS,9.148361554750805,,0,0,0,9.148361554750805,5.08457864018204,,0,0,0,5.08457864018204,173.63656933276167,,0,0,0,173.63656933276167,55.972141545349096,,0,0,0,55.972141545349096,33.961431139993344,,0,0,0,33.961431139993344,121.40393241453546,,0,0,0,121.40393241453546
85,VAL,8.127370267893218,,0,0,0,8.127370267893218,5.366407256954158,,0,0,0,5.366407256954158,174.30713807228327,,0,0,0,174.30713807228327,59.105510170806966,,0,0,0,59.105510170806966,35.098626201737154,,0,0,0,35.098626201737154,120.15612042775003,,0,0,0,120.15612042775003
86,GLY,8.89668879022644,,0,0,0,8.89668879022644,4.411959666616717,,0,0,0,4.411959666616717,171.93099577915973,,0,0,0,171.93099577915973,44.707075842551895,,0,0,0,44.707075842551895,,,0,0,0,,111.21198192782218,,0,0,0,111.21198192782218
87,ILE,9.275985521423022,,0,0,0,9.275985521423022,4.825017317909868,,0,0,0,4.825017317909868,174.85887028887225,,0,0,0,174.85887028887225,60.600397523176824,,0,0,0,60.600397523176824,39.86784525800311,,0,0,0,39.86784525800311,119.94488441155512,,0,0,0,119.94488441155512
88,TYR,9.355607462276613,,0,0,0,9.355607462276613,5.018104766894217,,0,0,0,5.018104766894217,175.56512999152514,,0,0,0,175.56512999152514,59.61791749604284,,0,0,0,59.61791749604284,39.568397693889445,,0,0,0,39.568397693889445,127.88399151598955,,0,0,0,127.88399151598955
89,ILE,8.51693999000444,,0,0,0,8.51693999000444,4.535785433918859,,0,0,0,4.535785433918859,174.83848817684537,,0,0,0,174.83848817684537,60.33668820049395,,0,0,0,60.33668820049395,39.41222793801199,,0,0,0,39.41222793801199,119.60165518740149,,0,0,0,119.60165518740149