RESNUM,RESNAME,H_X,H_Y,H_BEST_REF_SCORE,H_BEST_REF_COV,H_BEST_REF_MATCH,H_UCBShift,HA_X,HA_Y,HA_BEST_REF_SCORE,HA_BEST_REF_COV,HA_BEST_REF_MATCH,HA_UCBShift,C_X,C_Y,C_BEST_REF_SCORE,C_BEST_REF_COV,C_BEST_REF_MATCH,C_UCBShift,CA_X,CA_Y,CA_BEST_REF_SCORE,CA_BEST_REF_COV,CA_BEST_REF_MATCH,CA_UCBShift,CB_X,CB_Y,CB_BEST_REF_SCORE,CB_BEST_REF_COV,CB_BEST_REF_MATCH,CB_UCBShift,N_X,N_Y,N_BEST_REF_SCORE,N_BEST_REF_COV,N_BEST_REF_MATCH,N_UCBShift
1,MET,8.367935512237763,,0,0,0,8.367935512237763,4.29567698038628,,0,0,0,4.29567698038628,174.57877813155733,,0,0,0,174.57877813155733,55.18890769584304,,0,0,0,55.18890769584304,33.10310326973582,,0,0,0,33.10310326973582,121.0425879586469,,0,0,0,121.0425879586469
2,ASN,8.5444038006327,,0,0,0,8.5444038006327,4.844717047680098,,0,0,0,4.844717047680098,174.9250980873626,,0,0,0,174.9250980873626,52.5540931438839,,0,0,0,52.5540931438839,39.59759603139083,,0,0,0,39.59759603139083,120.37101627634588,,0,0,0,120.37101627634588
3,TYR,8.881785206843157,,0,0,0,8.881785206843157,4.609114334876235,,0,0,0,4.609114334876235,176.0099006347486,,0,0,0,176.0099006347486,58.230602908380504,,0,0,0,58.230602908380504,39.79859685789766,,0,0,0,39.79859685789766,122.76273570508936,,0,0,0,122.76273570508936
4,LYS,8.70761841163836,,0,0,0,8.70761841163836,4.345346128971029,,0,0,0,4.345346128971029,178.44071469906206,,0,0,0,178.44071469906206,55.832962063408814,,0,0,0,55.832962063408814,33.191255175402375,,0,0,0,33.191255175402375,121.02844435291375,,0,0,0,121.02844435291375
5,ILE,8.58886923970474,,0,0,0,8.58886923970474,3.7572477378871136,,0,0,0,3.7572477378871136,177.4789157986014,,0,0,0,177.4789157986014,64.52529401671661,,0,0,0,64.52529401671661,37.59909171973582,,0,0,0,37.59909171973582,122.45924478154069,,0,0,0,122.45924478154069
6,SER,8.223310791114441,,0,0,0,8.223310791114441,4.257768890057165,,0,0,0,4.257768890057165,175.50774346648907,,0,0,0,175.50774346648907,60.31912038291708,,0,0,0,60.31912038291708,62.98935948600843,,0,0,0,62.98935948600843,114.59025478348319,,0,0,0,114.59025478348319
7,GLU,7.795890987717837,,0,0,0,7.795890987717837,4.317902729276279,,0,0,0,4.317902729276279,176.87971734678655,,0,0,0,176.87971734678655,56.423927631424135,,0,0,0,56.423927631424135,30.318483814829616,,0,0,0,30.318483814829616,120.28648955798091,,0,0,0,120.28648955798091
8,LEU,7.304762021717171,,0,0,0,7.304762021717171,3.9984280364635363,,0,0,0,3.9984280364635363,175.55308536117215,,0,0,0,175.55308536117215,55.302365725285824,,0,0,0,55.302365725285824,41.87368855777001,,0,0,0,41.87368855777001,121.14201213892218,,0,0,0,121.14201213892218
9,MET,7.719413544061493,,0,0,0,7.719413544061493,4.966866104900655,,0,0,0,4.966866104900655,173.5029274061605,,0,0,0,173.5029274061605,52.37699597523587,,0,0,0,52.37699597523587,33.43334026220446,,0,0,0,33.43334026220446,120.94607374273505,,0,0,0,120.94607374273505
10,PRO,,,0,0,0,,4.147388423398823,,0,0,0,4.147388423398823,177.04389543195694,,0,0,0,177.04389543195694,63.750619517887664,,0,0,0,63.750619517887664,31.497371826667777,,0,0,0,31.497371826667777,,,0,0,0,
11,ASN,8.843797524925074,,0,0,0,8.843797524925074,4.144539550993451,,0,0,0,4.144539550993451,174.4526358224997,,0,0,0,174.4526358224997,54.8710708055722,,0,0,0,54.8710708055722,37.90233936575646,,0,0,0,37.90233936575646,115.05972914941725,,0,0,0,115.05972914941725
12,LEU,7.500236107886558,,0,0,0,7.500236107886558,4.4205025164446665,,0,0,0,4.4205025164446665,175.0677173056499,,0,0,0,175.0677173056499,54.47078585675436,,0,0,0,54.47078585675436,42.83071997087357,,0,0,0,42.83071997087357,123.16819522760018,,0,0,0,123.16819522760018
13,SER,8.562512174408925,,0,0,0,8.562512174408925,5.2805501173437674,,0,0,0,5.2805501173437674,174.00980877519146,,0,0,0,174.00980877519146,57.20538542005217,,0,0,0,57.20538542005217,64.46025503334444,,0,0,0,64.46025503334444,120.55988761939173,,0,0,0,120.55988761939173
14,GLY,8.861590338000887,,0,0,0,8.861590338000887,4.241207612201688,,0,0,0,4.241207612201688,171.94958578741813,,0,0,0,171.94958578741813,45.9318905541403,,0,0,0,45.9318905541403,,,0,0,0,,111.1295954972361,,0,0,0,111.1295954972361
15,THR,8.559015712420912,,0,0,0,8.559015712420912,5.241334556243757,,0,0,0,5.241334556243757,174.27547851456876,,0,0,0,174.27547851456876,61.984646509407256,,0,0,0,61.984646509407256,70.72098351530691,,0,0,0,70.72098351530691,117.29938958317238,,0,0,0,117.29938958317238
16,ILE,9.170991421572873,,0,0,0,9.170991421572873,5.013961523137973,,0,0,0,5.013961523137973,173.96783288483184,,0,0,0,173.96783288483184,59.23824234267399,,0,0,0,59.23824234267399,41.64615381596737,,0,0,0,41.64615381596737,120.75266043876124,,0,0,0,120.75266043876124
17,ASN,8.721630301720502,,0,0,0,8.721630301720502,5.53338667904873,,0,0,0,5.53338667904873,174.71716800989566,,0,0,0,174.71716800989566,52.451747684615384,,0,0,0,52.451747684615384,40.76611027799978,,0,0,0,40.76611027799978,122.5468647398546,,0,0,0,122.5468647398546
18,ALA,8.866475765079365,,0,0,0,8.866475765079365,4.822980613181264,,0,0,0,4.822980613181264,175.51727312168944,,0,0,0,175.51727312168944,51.030882529992226,,0,0,0,51.030882529992226,23.66442066724942,,0,0,0,23.66442066724942,125.11889093422133,,0,0,0,125.11889093422133
19,GLU,8.989916822138973,,0,0,0,8.989916822138973,4.898762518093018,,0,0,0,4.898762518093018,176.1186967987124,,0,0,0,176.1186967987124,55.885981803574204,,0,0,0,55.885981803574204,30.735582348595848,,0,0,0,30.735582348595848,121.76958950804196,,0,0,0,121.76958950804196
20,VAL,9.213567792451993,,0,0,0,9.213567792451993,4.115032777156177,,0,0,0,4.115032777156177,175.752707147669,,0,0,0,175.752707147669,63.81177661944722,,0,0,0,63.81177661944722,31.13588244027084,,0,0,0,31.13588244027084,126.80594653786214,,0,0,0,126.80594653786214
21,VAL,8.87704013115218,,0,0,0,8.87704013115218,4.010941097971473,,0,0,0,4.010941097971473,175.82806419101456,,0,0,0,175.82806419101456,63.54433610672106,,0,0,0,63.54433610672106,32.6936171487013,,0,0,0,32.6936171487013,128.61030053389945,,0,0,0,128.61030053389945
22,ALA,7.952023611100011,,0,0,0,7.952023611100011,4.609965942229993,,0,0,0,4.609965942229993,175.26553229933955,,0,0,0,175.26553229933955,51.88599436294261,,0,0,0,51.88599436294261,22.07005197712843,,0,0,0,22.07005197712843,120.94905579216893,,0,0,0,120.94905579216893
23,ALA,8.619748171117772,,0,0,0,8.619748171117772,4.65280597969253,,0,0,0,4.65280597969253,177.16793818280055,,0,0,0,177.16793818280055,51.70825266622821,,0,0,0,51.70825266622821,20.299522323781776,,0,0,0,20.299522323781776,124.37152511038406,,0,0,0,124.37152511038406
24,TYR,8.90797996933067,,0,0,0,8.90797996933067,4.762150429750805,,0,0,0,4.762150429750805,174.3293667831724,,0,0,0,174.3293667831724,56.344067145276945,,0,0,0,56.344067145276945,37.921858861399706,,0,0,0,37.921858861399706,123.2637401589355,,0,0,0,123.2637401589355
25,PRO,,,0,0,0,,4.450338876792652,,0,0,0,4.450338876792652,177.18303753367744,,0,0,0,177.18303753367744,62.92069025984016,,0,0,0,62.92069025984016,32.2482844960484,,0,0,0,32.2482844960484,,,0,0,0,
26,LYS,8.54888121931402,,0,0,0,8.54888121931402,4.405463391153291,,0,0,0,4.405463391153291,176.1591577091464,,0,0,0,176.1591577091464,56.69467732999778,,0,0,0,56.69467732999778,33.000190726012875,,0,0,0,33.000190726012875,121.4321297441281,,0,0,0,121.4321297441281
27,LYS,8.77651295124875,,0,0,0,8.77651295124875,4.739949471289822,,0,0,0,4.739949471289822,175.28542089330114,,0,0,0,175.28542089330114,55.24189732061272,,0,0,0,55.24189732061272,35.103100047491395,,0,0,0,35.103100047491395,123.45098687066823,,0,0,0,123.45098687066823
28,GLU,8.653768317127318,,0,0,0,8.653768317127318,5.3481981441058934,,0,0,0,5.3481981441058934,175.96456197957042,,0,0,0,175.96456197957042,55.31260670883006,,0,0,0,55.31260670883006,32.04786933984349,,0,0,0,32.04786933984349,123.43076608171273,,0,0,0,123.43076608171273
29,PHE,9.081876034831836,,0,0,0,9.081876034831836,5.02906632058497,,0,0,0,5.02906632058497,173.1468362074814,,0,0,0,173.1468362074814,56.11090488470418,,0,0,0,56.11090488470418,41.33957053984349,,0,0,0,41.33957053984349,120.53983492662893,,0,0,0,120.53983492662893
30,SER,8.788731442546343,,0,0,0,8.788731442546343,4.518340082090132,,0,0,0,4.518340082090132,174.53512860312466,,0,0,0,174.53512860312466,58.482196711660556,,0,0,0,58.482196711660556,63.88545808081918,,0,0,0,63.88545808081918,117.21400861730491,,0,0,0,117.21400861730491
31,ARG,8.757816585808635,,0,0,0,8.757816585808635,4.498481742873793,,0,0,0,4.498481742873793,178.20926121141082,,0,0,0,178.20926121141082,55.502469624691976,,0,0,0,55.502469624691976,31.245318997724496,,0,0,0,31.245318997724496,125.03633512646797,,0,0,0,125.03633512646797
32,LYS,8.849764194244642,,0,0,0,8.849764194244642,4.167365308602508,,0,0,0,4.167365308602508,176.41254958820622,,0,0,0,176.41254958820622,58.105344704933955,,0,0,0,58.105344704933955,32.39977805603841,,0,0,0,32.39977805603841,121.4166397854812,,0,0,0,121.4166397854812
33,ASP,8.07862611042291,,0,0,0,8.07862611042291,4.637906193575868,,0,0,0,4.637906193575868,176.90446416326452,,0,0,0,176.90446416326452,53.60975363664114,,0,0,0,53.60975363664114,40.66767795980686,,0,0,0,40.66767795980686,118.2815692420191,,0,0,0,118.2815692420191
34,GLY,8.155283308408258,,0,0,0,8.155283308408258,3.9432932038655784,,0,0,0,3.9432932038655784,174.21966198152404,,0,0,0,174.21966198152404,45.44139710757021,,0,0,0,45.44139710757021,,,0,0,0,,108.72748636239317,,0,0,0,108.72748636239317
35,THR,7.869679007609058,,0,0,0,7.869679007609058,4.314358101293151,,0,0,0,4.314358101293151,173.80323968566987,,0,0,0,173.80323968566987,61.61928149659784,,0,0,0,61.61928149659784,70.1436438065712,,0,0,0,70.1436438065712,113.93393292232211,,0,0,0,113.93393292232211
36,LYS,8.451505277866577,,0,0,0,8.451505277866577,4.3672692665723165,,0,0,0,4.3672692665723165,175.59753023992673,,0,0,0,175.59753023992673,56.34533174170274,,0,0,0,56.34533174170274,33.07183792167832,,0,0,0,33.07183792167832,123.3176046431735,,0,0,0,123.3176046431735
37,GLY,8.638027701870351,,0,0,0,8.638027701870351,3.650702891181041,,0,0,0,3.650702891181041,171.94198591809302,,0,0,0,171.94198591809302,44.58852915089355,,0,0,0,44.58852915089355,,,0,0,0,,112.6044592518315,,0,0,0,112.6044592518315
38,GLN,8.50767373961594,,0,0,0,8.50767373961594,5.348986464990564,,0,0,0,5.348986464990564,175.00529414515483,,0,0,0,175.00529414515483,54.563470564346765,,0,0,0,54.563470564346765,31.840352465268065,,0,0,0,31.840352465268065,121.08383528600288,,0,0,0,121.08383528600288
39,LEU,9.36752798927184,,0,0,0,9.36752798927184,5.183053287878789,,0,0,0,5.183053287878789,174.8259223080364,,0,0,0,174.8259223080364,53.37150320104895,,0,0,0,53.37150320104895,45.85426108605284,,0,0,0,45.85426108605284,122.70474355716506,,0,0,0,122.70474355716506
40,LYS,8.795082098734598,,0,0,0,8.795082098734598,4.650146166033966,,0,0,0,4.650146166033966,174.79636916918082,,0,0,0,174.79636916918082,54.787315850899105,,0,0,0,54.787315850899105,36.54215440241425,,0,0,0,36.54215440241425,122.645796752109,,0,0,0,122.645796752109
41,SER,9.064289873754024,,0,0,0,9.064289873754024,5.377285897263848,,0,0,0,5.377285897263848,173.6902728445499,,0,0,0,173.6902728445499,57.58233998039738,,0,0,0,57.58233998039738,64.75168817655677,,0,0,0,64.75168817655677,120.69943632921523,,0,0,0,120.69943632921523
42,LEU,9.235865442823844,,0,0,0,9.235865442823844,5.290131957770009,,0,0,0,5.290131957770009,175.78644755223664,,0,0,0,175.78644755223664,53.04332642962038,,0,0,0,53.04332642962038,45.38142277885448,,0,0,0,45.38142277885448,123.23420552697303,,0,0,0,123.23420552697303
43,PHE,9.180288355788656,,0,0,0,9.180288355788656,4.8185058342990335,,0,0,0,4.8185058342990335,174.3785156896326,,0,0,0,174.3785156896326,57.23163716746587,,0,0,0,57.23163716746587,40.604208395116,,0,0,0,40.604208395116,123.04157632773892,,0,0,0,123.04157632773892
44,LEU,8.914979971423021,,0,0,0,8.914979971423021,5.236837694233545,,0,0,0,5.236837694233545,175.32449399364523,,0,0,0,175.32449399364523,52.89427265888556,,0,0,0,52.89427265888556,44.36304282045732,,0,0,0,44.36304282045732,128.15724466762126,,0,0,0,128.15724466762126
45,LYS,8.765273573448773,,0,0,0,8.765273573448773,5.175099412576312,,0,0,0,5.175099412576312,174.70560632331,,0,0,0,174.70560632331,54.96791602847708,,0,0,0,54.96791602847708,36.5309105960484,,0,0,0,36.5309105960484,122.24866628001999,,0,0,0,122.24866628001999
46,ASP,8.843693341930292,,0,0,0,8.843693341930292,4.987176872288822,,0,0,0,4.987176872288822,177.12318551309804,,0,0,0,177.12318551309804,53.171641582473086,,0,0,0,53.171641582473086,43.345363352586304,,0,0,0,43.345363352586304,126.51872962577978,,0,0,0,126.51872962577978
47,ASP,8.849822076196027,,0,0,0,8.849822076196027,4.428355854839605,,0,0,0,4.428355854839605,177.28043975295816,,0,0,0,177.28043975295816,56.54021545189255,,0,0,0,56.54021545189255,40.772571062898216,,0,0,0,40.772571062898216,120.79370403744589,,0,0,0,120.79370403744589
48,THR,8.042639865251415,,0,0,0,8.042639865251415,4.463490509976134,,0,0,0,4.463490509976134,174.70316829084803,,0,0,0,174.70316829084803,62.2274560507215,,0,0,0,62.2274560507215,69.84614346945277,,0,0,0,69.84614346945277,106.93807794685314,,0,0,0,106.93807794685314
49,GLY,7.7499635416416925,,0,0,0,7.7499635416416925,4.169404081174381,,0,0,0,4.169404081174381,171.7473970911311,,0,0,0,171.7473970911311,45.2659950426407,,0,0,0,45.2659950426407,,,0,0,0,,109.93536691360306,,0,0,0,109.93536691360306
50,SER,8.329803175990676,,0,0,0,8.329803175990676,5.207738248656899,,0,0,0,5.207738248656899,172.93360682253302,,0,0,0,172.93360682253302,57.02402841783216,,0,0,0,57.02402841783216,65.98599639155844,,0,0,0,65.98599639155844,114.92187111926407,,0,0,0,114.92187111926407
51,ILE,8.782442368054168,,0,0,0,8.782442368054168,4.4643315240454,,0,0,0,4.4643315240454,172.92869742898213,,0,0,0,172.92869742898213,59.64040041480187,,0,0,0,59.64040041480187,42.14241641394716,,0,0,0,42.14241641394716,122.42771161777112,,0,0,0,122.42771161777112
52,ARG,8.438640235359086,,0,0,0,8.438640235359086,4.940440188866688,,0,0,0,4.940440188866688,175.77200077903765,,0,0,0,175.77200077903765,55.39791982280497,,0,0,0,55.39791982280497,31.75987127864358,,0,0,0,31.75987127864358,126.08776468015873,,0,0,0,126.08776468015873
53,GLY,9.054858230497281,,0,0,0,9.054858230497281,4.123861197066822,,0,0,0,4.123861197066822,172.0311288994894,,0,0,0,172.0311288994894,44.738030033288936,,0,0,0,44.738030033288936,,,0,0,0,,115.63962511843157,,0,0,0,115.63962511843157
54,THR,8.747482117871018,,0,0,0,8.747482117871018,4.873098922649573,,0,0,0,4.873098922649573,173.7987274140748,,0,0,0,173.7987274140748,61.74746711138861,,0,0,0,61.74746711138861,70.10187812283272,,0,0,0,70.10187812283272,119.8356086641636,,0,0,0,119.8356086641636
55,LEU,9.175731354218003,,0,0,0,9.175731354218003,4.637893997896548,,0,0,0,4.637893997896548,175.23935463252857,,0,0,0,175.23935463252857,54.436560558325006,,0,0,0,54.436560558325006,43.48093950824176,,0,0,0,43.48093950824176,128.50598011669442,,0,0,0,128.50598011669442
56,TRP,9.026919737778886,,0,0,0,9.026919737778886,5.306214337606837,,0,0,0,5.306214337606837,176.86912695994562,,0,0,0,176.86912695994562,56.08999347524698,,0,0,0,56.08999347524698,32.445303777633484,,0,0,0,32.445303777633484,121.61752459251859,,0,0,0,121.61752459251859
57,ASN,9.187269096875347,,0,0,0,9.187269096875347,4.332097143303919,,0,0,0,4.332097143303919,176.96486739279052,,0,0,0,176.96486739279052,55.318648443217896,,0,0,0,55.318648443217896,37.787557512864915,,0,0,0,37.787557512864915,120.4496690559274,,0,0,0,120.4496690559274
58,GLU,9.031737003518703,,0,0,0,9.031737003518703,4.1681711018093015,,0,0,0,4.1681711018093015,178.4098164165945,,0,0,0,178.4098164165945,58.86851378390498,,0,0,0,58.86851378390498,28.987895946309244,,0,0,0,28.987895946309244,121.8641777486014,,0,0,0,121.8641777486014
59,LEU,8.02057056984682,,0,0,0,8.02057056984682,4.2490514500333,,0,0,0,4.2490514500333,178.34154221497946,,0,0,0,178.34154221497946,57.06023297062937,,0,0,0,57.06023297062937,41.41017909350094,,0,0,0,41.41017909350094,119.54038951408036,,0,0,0,119.54038951408036
60,ALA,8.354733318281719,,0,0,0,8.354733318281719,4.0416197640109885,,0,0,0,4.0416197640109885,177.57390645147075,,0,0,0,177.57390645147075,53.89800582011322,,0,0,0,53.89800582011322,18.610259433577536,,0,0,0,18.610259433577536,120.33877393360528,,0,0,0,120.33877393360528
61,ASP,7.821683656776557,,0,0,0,7.821683656776557,4.763292687803863,,0,0,0,4.763292687803863,176.34049242105118,,0,0,0,176.34049242105118,54.523654935153736,,0,0,0,54.523654935153736,41.28633706357532,,0,0,0,41.28633706357532,115.25827981270952,,0,0,0,115.25827981270952
62,PHE,7.794368581879233,,0,0,0,7.794368581879233,4.279764887656787,,0,0,0,4.279764887656787,175.6070338244145,,0,0,0,175.6070338244145,59.395339088544794,,0,0,0,59.395339088544794,39.964229550666005,,0,0,0,39.964229550666005,122.95076264007103,,0,0,0,122.95076264007103
63,GLU,8.010422188111889,,0,0,0,8.010422188111889,4.210861217249417,,0,0,0,4.210861217249417,175.09632957192807,,0,0,0,175.09632957192807,56.40189127982018,,0,0,0,56.40189127982018,29.474530966011766,,0,0,0,29.474530966011766,127.69317704235209,,0,0,0,127.69317704235209
64,VAL,7.89616764127539,,0,0,0,7.89616764127539,4.499391642296592,,0,0,0,4.499391642296592,173.92425601400268,,0,0,0,173.92425601400268,60.24579237195027,,0,0,0,60.24579237195027,35.222001819336214,,0,0,0,35.222001819336214,121.18881600850816,,0,0,0,121.18881600850816
65,LYS,8.696529223482072,,0,0,0,8.696529223482072,4.615137049755799,,0,0,0,4.615137049755799,175.69871332344877,,0,0,0,175.69871332344877,54.09165258800644,,0,0,0,54.09165258800644,35.34310452899878,,0,0,0,35.34310452899878,124.43041837481408,,0,0,0,124.43041837481408
66,LYS,8.534964347968698,,0,0,0,8.534964347968698,3.9478252488539236,,0,0,0,3.9478252488539236,177.72716829312353,,0,0,0,177.72716829312353,58.152871923465426,,0,0,0,58.152871923465426,32.35985307120102,,0,0,0,32.35985307120102,121.45565329508825,,0,0,0,121.45565329508825
67,GLY,9.05098195965701,,0,0,0,9.05098195965701,3.9806079173215667,,0,0,0,3.9806079173215667,174.46976696139416,,0,0,0,174.46976696139416,45.18583056104451,,0,0,0,45.18583056104451,,,0,0,0,,114.12425222491397,,0,0,0,114.12425222491397
68,ASP,7.993108392224443,,0,0,0,7.993108392224443,4.81196766994117,,0,0,0,4.81196766994117,175.78520351919747,,0,0,0,175.78520351919747,55.41057397605173,,0,0,0,55.41057397605173,41.15420323548674,,0,0,0,41.15420323548674,121.57238575926851,,0,0,0,121.57238575926851
69,ILE,8.821952721012321,,0,0,0,8.821952721012321,4.486933440664891,,0,0,0,4.486933440664891,175.26197579185813,,0,0,0,175.26197579185813,59.67533296305916,,0,0,0,59.67533296305916,37.47412815849151,,0,0,0,37.47412815849151,121.97569992693418,,0,0,0,121.97569992693418
70,ALA,9.32130101073926,,0,0,0,9.32130101073926,5.317524033599734,,0,0,0,5.317524033599734,175.11838156000667,,0,0,0,175.11838156000667,49.52639398785104,,0,0,0,49.52639398785104,22.99509195194806,,0,0,0,22.99509195194806,131.35208958245641,,0,0,0,131.35208958245641
71,GLU,9.003961791425242,,0,0,0,9.003961791425242,5.035822108380509,,0,0,0,5.035822108380509,175.53856242622933,,0,0,0,175.53856242622933,55.520376337007434,,0,0,0,55.520376337007434,31.116562289710288,,0,0,0,31.116562289710288,122.86062843210678,,0,0,0,122.86062843210678
72,VAL,9.276372352863802,,0,0,0,9.276372352863802,4.756765378621378,,0,0,0,4.756765378621378,174.3911107870685,,0,0,0,174.3911107870685,60.93066918117994,,0,0,0,60.93066918117994,33.91279886266511,,0,0,0,33.91279886266511,127.03127775255855,,0,0,0,127.03127775255855
73,SER,8.937712323942725,,0,0,0,8.937712323942725,5.349482636507936,,0,0,0,5.349482636507936,174.01359426974136,,0,0,0,174.01359426974136,56.06177192308247,,0,0,0,56.06177192308247,65.23763820967366,,0,0,0,65.23763820967366,122.42461061855366,,0,0,0,122.42461061855366
74,GLY,8.86672850998446,,0,0,0,8.86672850998446,4.24882665515873,,0,0,0,4.24882665515873,171.00044046834833,,0,0,0,171.00044046834833,46.56090439960595,,0,0,0,46.56090439960595,,,0,0,0,,112.51708774274614,,0,0,0,112.51708774274614
75,TYR,8.798781823920523,,0,0,0,8.798781823920523,5.084942500227551,,0,0,0,5.084942500227551,175.00724556774892,,0,0,0,175.00724556774892,56.983894133533134,,0,0,0,56.983894133533134,40.40333516609501,,0,0,0,40.40333516609501,121.39834891146076,,0,0,0,121.39834891146076
76,VAL,8.774297905172604,,0,0,0,8.774297905172604,4.381997289538239,,0,0,0,4.381997289538239,174.88985192640695,,0,0,0,174.88985192640695,62.33361065687646,,0,0,0,62.33361065687646,32.15591231270396,,0,0,0,32.15591231270396,127.13174449098679,,0,0,0,127.13174449098679
77,LYS,8.937374307853258,,0,0,0,8.937374307853258,4.634372831074481,,0,0,0,4.634372831074481,174.844647964874,,0,0,0,174.844647964874,54.31732660850261,,0,0,0,54.31732660850261,36.038434379365086,,0,0,0,36.038434379365086,126.05747461122212,,0,0,0,126.05747461122212
78,GLN,8.682126345038295,,0,0,0,8.682126345038295,4.527879453468754,,0,0,0,4.527879453468754,175.4455676197358,,0,0,0,175.4455676197358,55.718134850011104,,0,0,0,55.718134850011104,28.80379616162726,,0,0,0,28.80379616162726,122.32434625441225,,0,0,0,122.32434625441225
79,GLY,8.820342876162726,,0,0,0,8.820342876162726,4.037705622089022,,0,0,0,4.037705622089022,175.19558557404264,,0,0,0,175.19558557404264,44.68764920655456,,0,0,0,44.68764920655456,,,0,0,0,,114.65137887934843,,0,0,0,114.65137887934843
80,TYR,8.545825756460205,,0,0,0,8.545825756460205,4.2641785737734486,,0,0,0,4.2641785737734486,176.69127134384505,,0,0,0,176.69127134384505,60.206475828654675,,0,0,0,60.206475828654675,38.311720333927184,,0,0,0,38.311720333927184,120.49029776170495,,0,0,0,120.49029776170495
81,SER,8.284734918170718,,0,0,0,8.284734918170718,4.550709441602841,,0,0,0,4.550709441602841,174.09775168021423,,0,0,0,174.09775168021423,58.361734898495946,,0,0,0,58.361734898495946,63.65614212902098,,0,0,0,63.65614212902098,114.56163662249418,,0,0,0,114.56163662249418
82,GLY,7.7881399998113,,0,0,0,7.7881399998113,4.097630465445666,,0,0,0,4.097630465445666,173.39689516628926,,0,0,0,173.39689516628926,44.345938472860475,,0,0,0,44.345938472860475,,,0,0,0,,109.30978905815296,,0,0,0,109.30978905815296
83,LEU,8.475731185153736,,0,0,0,8.475731185153736,4.691612787640138,,0,0,0,4.691612787640138,176.71843251361972,,0,0,0,176.71843251361972,55.82823433608613,,0,0,0,55.82823433608613,43.20978859019869,,0,0,0,43.20978859019869,122.28086909230214,,0,0,0,122.28086909230214
84,GLU,9.137327888228437,,0,0,0,9.137327888228437,5.101659916139416,,0,0,0,5.101659916139416,174.79686642834386,,0,0,0,174.79686642834386,54.592568245615496,,0,0,0,54.592568245615496,33.60530378030303,,0,0,0,33.60530378030303,120.86137880612166,,0,0,0,120.86137880612166
85,ILE,9.191861907081808,,0,0,0,9.191861907081808,4.550099117349317,,0,0,0,4.550099117349317,173.77537481954712,,0,0,0,173.77537481954712,59.52632121754912,,0,0,0,59.52632121754912,39.57233428865024,,0,0,0,39.57233428865024,123.89029357883228,,0,0,0,123.89029357883228
86,SER,9.094374624669776,,0,0,0,9.094374624669776,5.025675907187257,,0,0,0,5.025675907187257,173.74421109975023,,0,0,0,173.74421109975023,57.427561881895876,,0,0,0,57.427561881895876,63.66276969546564,,0,0,0,63.66276969546564,122.46795903344989,,0,0,0,122.46795903344989
87,VAL,8.964808862315463,,0,0,0,8.964808862315463,3.988801647308247,,0,0,0,3.988801647308247,175.31660135795318,,0,0,0,175.31660135795318,64.02662795425131,,0,0,0,64.02662795425131,32.06544181541791,,0,0,0,32.06544181541791,128.27731082963146,,0,0,0,128.27731082963146
88,ASP,9.028561154090355,,0,0,0,9.028561154090355,4.91569758951049,,0,0,0,4.91569758951049,176.09824300420692,,0,0,0,176.09824300420692,55.331809752497506,,0,0,0,55.331809752497506,43.67214398754579,,0,0,0,43.67214398754579,129.30379815125985,,0,0,0,129.30379815125985
89,ASN,8.41642698992119,,0,0,0,8.41642698992119,4.861976226584527,,0,0,0,4.861976226584527,172.90894145371294,,0,0,0,172.90894145371294,52.703216371134424,,0,0,0,52.703216371134424,42.423892484498836,,0,0,0,42.423892484498836,115.90476836683317,,0,0,0,115.90476836683317