RESNUM,RESNAME,H_X,H_Y,H_BEST_REF_SCORE,H_BEST_REF_COV,H_BEST_REF_MATCH,H_UCBShift,HA_X,HA_Y,HA_BEST_REF_SCORE,HA_BEST_REF_COV,HA_BEST_REF_MATCH,HA_UCBShift,C_X,C_Y,C_BEST_REF_SCORE,C_BEST_REF_COV,C_BEST_REF_MATCH,C_UCBShift,CA_X,CA_Y,CA_BEST_REF_SCORE,CA_BEST_REF_COV,CA_BEST_REF_MATCH,CA_UCBShift,CB_X,CB_Y,CB_BEST_REF_SCORE,CB_BEST_REF_COV,CB_BEST_REF_MATCH,CB_UCBShift,N_X,N_Y,N_BEST_REF_SCORE,N_BEST_REF_COV,N_BEST_REF_MATCH,N_UCBShift
1,MET,8.292837887351537,,0,0,0,8.292837887351537,4.279844329609279,,0,0,0,4.279844329609279,175.60809085246976,,0,0,0,175.60809085246976,55.56506391551226,,0,0,0,55.56506391551226,32.2351900974914,,0,0,0,32.2351900974914,121.13911636625596,,0,0,0,121.13911636625596
2,GLY,8.291175245487846,,0,0,0,8.291175245487846,3.8351959596708856,,0,0,0,3.8351959596708856,173.68256283778445,,0,0,0,173.68256283778445,45.23934995889666,,0,0,0,45.23934995889666,,,0,0,0,,110.78539026314796,,0,0,0,110.78539026314796
3,HIS,8.260497908458209,,0,0,0,8.260497908458209,4.443160892063492,,0,0,0,4.443160892063492,174.49410367109556,,0,0,0,174.49410367109556,55.699605574497724,,0,0,0,55.699605574497724,29.012753155233657,,0,0,0,29.012753155233657,120.13793036489066,,0,0,0,120.13793036489066
4,HIS,8.286642474875125,,0,0,0,8.286642474875125,4.57233813024198,,0,0,0,4.57233813024198,174.49569788520367,,0,0,0,174.49569788520367,55.10941268756244,,0,0,0,55.10941268756244,28.784831568575868,,0,0,0,28.784831568575868,121.65307754245755,,0,0,0,121.65307754245755
5,HIS,8.24069264009879,,0,0,0,8.24069264009879,4.420586909151959,,0,0,0,4.420586909151959,174.59379301971362,,0,0,0,174.59379301971362,56.30369772489177,,0,0,0,56.30369772489177,28.69433949889,,0,0,0,28.69433949889,121.04293113596404,,0,0,0,121.04293113596404
6,HIS,8.267920871978022,,0,0,0,8.267920871978022,4.5117326781107785,,0,0,0,4.5117326781107785,174.47416332132866,,0,0,0,174.47416332132866,55.61048719667554,,0,0,0,55.61048719667554,28.884433821761572,,0,0,0,28.884433821761572,121.74911815333,,0,0,0,121.74911815333
7,HIS,8.25109306002331,,0,0,0,8.25109306002331,4.309289607409258,,0,0,0,4.309289607409258,174.63239419807414,,0,0,0,174.63239419807414,56.53467719207459,,0,0,0,56.53467719207459,29.299015737362637,,0,0,0,29.299015737362637,122.29115981143856,,0,0,0,122.29115981143856
8,HIS,8.315746959684759,,0,0,0,8.315746959684759,4.362153527716727,,0,0,0,4.362153527716727,174.60778258893328,,0,0,0,174.60778258893328,55.54998487248307,,0,0,0,55.54998487248307,28.48317266812077,,0,0,0,28.48317266812077,122.9220007985015,,0,0,0,122.9220007985015
9,SER,8.0965923494894,,0,0,0,8.0965923494894,4.452667935037185,,0,0,0,4.452667935037185,175.18660263024753,,0,0,0,175.18660263024753,58.134045474092574,,0,0,0,58.134045474092574,63.74453225308025,,0,0,0,63.74453225308025,118.49784582299922,,0,0,0,118.49784582299922
10,HIS,8.75291392095127,,0,0,0,8.75291392095127,4.416519068148518,,0,0,0,4.416519068148518,175.1885789761072,,0,0,0,175.1885789761072,55.90012726706627,,0,0,0,55.90012726706627,28.85560198040848,,0,0,0,28.85560198040848,123.44003184147519,,0,0,0,123.44003184147519
11,SER,8.38368986045066,,0,0,0,8.38368986045066,4.574419851565101,,0,0,0,4.574419851565101,173.8175163658064,,0,0,0,173.8175163658064,58.15450344493284,,0,0,0,58.15450344493284,63.191442299123096,,0,0,0,63.191442299123096,117.37502254676436,,0,0,0,117.37502254676436
12,THR,8.089742816927517,,0,0,0,8.089742816927517,4.265050124272949,,0,0,0,4.265050124272949,174.1831957310467,,0,0,0,174.1831957310467,62.267314309163055,,0,0,0,62.267314309163055,69.62793419306249,,0,0,0,69.62793419306249,116.41158965834165,,0,0,0,116.41158965834165
13,ILE,8.81664232765013,,0,0,0,8.81664232765013,4.542991280089355,,0,0,0,4.542991280089355,174.79730158960484,,0,0,0,174.79730158960484,60.133955214263516,,0,0,0,60.133955214263516,39.960303047130644,,0,0,0,39.960303047130644,124.90800899482186,,0,0,0,124.90800899482186
14,LYS,8.522393358663559,,0,0,0,8.522393358663559,4.864041173470973,,0,0,0,4.864041173470973,175.5980124594461,,0,0,0,175.5980124594461,55.6561833039405,,0,0,0,55.6561833039405,32.9630074966145,,0,0,0,32.9630074966145,127.01484055311356,,0,0,0,127.01484055311356
15,LEU,9.155251015090466,,0,0,0,9.155251015090466,5.064245143084693,,0,0,0,5.064245143084693,175.34660588101897,,0,0,0,175.34660588101897,53.31290668917749,,0,0,0,53.31290668917749,45.582291684132535,,0,0,0,45.582291684132535,123.23789237403152,,0,0,0,123.23789237403152
16,THR,8.899351043578644,,0,0,0,8.899351043578644,4.841004504251304,,0,0,0,4.841004504251304,173.9939883776723,,0,0,0,173.9939883776723,62.27636196733267,,0,0,0,62.27636196733267,70.15629156969142,,0,0,0,70.15629156969142,118.5069553933178,,0,0,0,118.5069553933178
17,VAL,9.372381457381506,,0,0,0,9.372381457381506,4.669740577355977,,0,0,0,4.669740577355977,175.30786275865802,,0,0,0,175.30786275865802,60.804457894089246,,0,0,0,60.804457894089246,32.54103221280386,,0,0,0,32.54103221280386,127.91543419371185,,0,0,0,127.91543419371185
18,LYS,9.107074837262736,,0,0,0,9.107074837262736,4.994250381379731,,0,0,0,4.994250381379731,175.68745414636473,,0,0,0,175.68745414636473,55.54459753135753,,0,0,0,55.54459753135753,33.42745585667111,,0,0,0,33.42745585667111,127.51280303615829,,0,0,0,127.51280303615829
19,PHE,9.226017782622934,,0,0,0,9.226017782622934,5.207558160306359,,0,0,0,5.207558160306359,175.9468447492785,,0,0,0,175.9468447492785,56.519751950666006,,0,0,0,56.519751950666006,41.96097272850483,,0,0,0,41.96097272850483,127.30052573633589,,0,0,0,127.30052573633589
20,GLY,9.03191394025419,,0,0,0,9.03191394025419,3.687807568462093,,0,0,0,3.687807568462093,174.7781915372905,,0,0,0,174.7781915372905,46.69403097403152,,0,0,0,46.69403097403152,,,0,0,0,,117.25773054916749,,0,0,0,117.25773054916749
21,GLY,8.51683959948385,,0,0,0,8.51683959948385,3.818445670371296,,0,0,0,3.818445670371296,174.02849384871794,,0,0,0,174.02849384871794,45.26055487170052,,0,0,0,45.26055487170052,,,0,0,0,,108.200259399112,,0,0,0,108.200259399112
22,LYS,7.861459874353423,,0,0,0,7.861459874353423,4.567011472377622,,0,0,0,4.567011472377622,175.55814385091574,,0,0,0,175.55814385091574,55.346117172305476,,0,0,0,55.346117172305476,34.18999672714508,,0,0,0,34.18999672714508,121.57622222635143,,0,0,0,121.57622222635143
23,SER,8.677029572416473,,0,0,0,8.677029572416473,5.021222721978022,,0,0,0,5.021222721978022,173.88410089408924,,0,0,0,173.88410089408924,57.19582020409035,,0,0,0,57.19582020409035,63.835578687767786,,0,0,0,63.835578687767786,118.98444471046732,,0,0,0,118.98444471046732
24,ILE,9.390369744688646,,0,0,0,9.390369744688646,4.458077867374292,,0,0,0,4.458077867374292,174.0476383628094,,0,0,0,174.0476383628094,57.94924193882784,,0,0,0,57.94924193882784,39.6926500397436,,0,0,0,39.6926500397436,125.82107646722721,,0,0,0,125.82107646722721
25,PRO,,,0,0,0,,4.913864413114664,,0,0,0,4.913864413114664,176.51725360351872,,0,0,0,176.51725360351872,62.00747547578533,,0,0,0,62.00747547578533,31.99745961042291,,0,0,0,31.99745961042291,,,0,0,0,
26,LEU,9.00735808980464,,0,0,0,9.00735808980464,4.7158303710733716,,0,0,0,4.7158303710733716,175.43034218934952,,0,0,0,175.43034218934952,53.5607709507992,,0,0,0,53.5607709507992,46.1895454993784,,0,0,0,46.1895454993784,125.3417307982795,,0,0,0,125.3417307982795
27,SER,8.47591073919414,,0,0,0,8.47591073919414,5.578484176234875,,0,0,0,5.578484176234875,174.14286416185482,,0,0,0,174.14286416185482,56.902685857442556,,0,0,0,56.902685857442556,64.16899060736486,,0,0,0,64.16899060736486,118.69918901301476,,0,0,0,118.69918901301476
28,VAL,8.729092804711954,,0,0,0,8.729092804711954,4.512370642879342,,0,0,0,4.512370642879342,174.58967649407816,,0,0,0,174.58967649407816,59.38869480589966,,0,0,0,59.38869480589966,35.6828284504329,,0,0,0,35.6828284504329,118.73158211514597,,0,0,0,118.73158211514597
29,SER,8.66174696021756,,0,0,0,8.66174696021756,4.777786660811411,,0,0,0,4.777786660811411,174.57859284992784,,0,0,0,174.57859284992784,56.16163852726718,,0,0,0,56.16163852726718,63.8798354083028,,0,0,0,63.8798354083028,117.52631520142634,,0,0,0,117.52631520142634
30,PRO,,,0,0,0,,4.259063740023865,,0,0,0,4.259063740023865,176.05416192513044,,0,0,0,176.05416192513044,64.33681494769674,,0,0,0,64.33681494769674,31.989283031651684,,0,0,0,31.989283031651684,,,0,0,0,
31,ASP,8.003996218487067,,0,0,0,8.003996218487067,4.589142771461871,,0,0,0,4.589142771461871,176.34694639133645,,0,0,0,176.34694639133645,53.94977004648685,,0,0,0,53.94977004648685,40.84879185386281,,0,0,0,40.84879185386281,116.45021025788101,,0,0,0,116.45021025788101
32,CYS,7.707716642174493,,0,0,0,7.707716642174493,4.205779997913198,,0,0,0,4.205779997913198,174.32542368487069,,0,0,0,174.32542368487069,60.46452646199912,,0,0,0,60.46452646199912,28.918677366544568,,0,0,0,28.918677366544568,119.3147541071151,,0,0,0,119.3147541071151
33,THR,8.321641031335332,,0,0,0,8.321641031335332,4.954119313819514,,0,0,0,4.954119313819514,176.37162248222887,,0,0,0,176.37162248222887,60.33683887378732,,0,0,0,60.33683887378732,71.6180609065712,,0,0,0,71.6180609065712,113.15608503750138,,0,0,0,113.15608503750138
34,VAL,8.47396178915529,,0,0,0,8.47396178915529,3.456064205994005,,0,0,0,3.456064205994005,177.7074457967366,,0,0,0,177.7074457967366,66.97136485476746,,0,0,0,66.97136485476746,31.51298524058164,,0,0,0,31.51298524058164,122.28098604057054,,0,0,0,122.28098604057054
35,LYS,8.053470536291485,,0,0,0,8.053470536291485,3.8611251514430016,,0,0,0,3.8611251514430016,178.5074893232878,,0,0,0,178.5074893232878,59.968694577894325,,0,0,0,59.968694577894325,32.11831236043956,,0,0,0,32.11831236043956,119.05789066196581,,0,0,0,119.05789066196581
36,ASP,7.820248885125985,,0,0,0,7.820248885125985,4.403540101504052,,0,0,0,4.403540101504052,178.65994914569322,,0,0,0,178.65994914569322,57.23677048080808,,0,0,0,57.23677048080808,41.55698951405262,,0,0,0,41.55698951405262,119.45744723329449,,0,0,0,119.45744723329449
37,LEU,8.125893913308914,,0,0,0,8.125893913308914,3.9461467731018987,,0,0,0,3.9461467731018987,178.91052476645575,,0,0,0,178.91052476645575,58.29381051989122,,0,0,0,58.29381051989122,42.139611922677325,,0,0,0,42.139611922677325,120.13024499301254,,0,0,0,120.13024499301254
38,LYS,8.260531316400266,,0,0,0,8.260531316400266,4.024764602652903,,0,0,0,4.024764602652903,179.23516573136308,,0,0,0,179.23516573136308,59.40071403943834,,0,0,0,59.40071403943834,32.436917743661894,,0,0,0,32.436917743661894,118.72417513568654,,0,0,0,118.72417513568654
39,SER,8.079490243506495,,0,0,0,8.079490243506495,4.162560363192363,,0,0,0,4.162560363192363,177.34598269856255,,0,0,0,177.34598269856255,61.714742755089354,,0,0,0,61.714742755089354,62.99834521268731,,0,0,0,62.99834521268731,115.85238797636252,,0,0,0,115.85238797636252
40,GLN,8.125045686269287,,0,0,0,8.125045686269287,4.132050980680431,,0,0,0,4.132050980680431,178.95349199920634,,0,0,0,178.95349199920634,58.69427203180708,,0,0,0,58.69427203180708,28.87032134890665,,0,0,0,28.87032134890665,121.35376123257298,,0,0,0,121.35376123257298
41,LEU,8.342929424808524,,0,0,0,8.342929424808524,4.120580997100122,,0,0,0,4.120580997100122,179.0033139558941,,0,0,0,179.0033139558941,56.92400583672994,,0,0,0,56.92400583672994,42.05745478806194,,0,0,0,42.05745478806194,118.92670051724386,,0,0,0,118.92670051724386
42,GLN,8.1025417005106,,0,0,0,8.1025417005106,4.357901853235654,,0,0,0,4.357901853235654,175.68036631842048,,0,0,0,175.68036631842048,61.75678198879454,,0,0,0,61.75678198879454,25.954339124220226,,0,0,0,25.954339124220226,122.86280742242202,,0,0,0,122.86280742242202
43,PRO,,,0,0,0,,4.392437724109224,,0,0,0,4.392437724109224,178.41901477072372,,0,0,0,178.41901477072372,65.27385877079031,,0,0,0,65.27385877079031,31.080050105400158,,0,0,0,31.080050105400158,,,0,0,0,
44,ILE,7.698868446414696,,0,0,0,7.698868446414696,3.877752990034965,,0,0,0,3.877752990034965,177.70299575482852,,0,0,0,177.70299575482852,63.716117843861696,,0,0,0,63.716117843861696,38.86392644482739,,0,0,0,38.86392644482739,117.67825655259186,,0,0,0,117.67825655259186
45,THR,8.166567201237651,,0,0,0,8.166567201237651,4.329870812132312,,0,0,0,4.329870812132312,175.5860856060828,,0,0,0,175.5860856060828,61.561509650371846,,0,0,0,61.561509650371846,69.85346634358419,,0,0,0,69.85346634358419,107.48541616696636,,0,0,0,107.48541616696636
46,ASN,7.887116386946388,,0,0,0,7.887116386946388,4.370382203760129,,0,0,0,4.370382203760129,174.6459005653957,,0,0,0,174.6459005653957,54.50247438366078,,0,0,0,54.50247438366078,37.61851308204573,,0,0,0,37.61851308204573,117.38735420304141,,0,0,0,117.38735420304141
47,VAL,7.3571620002109,,0,0,0,7.3571620002109,4.278455126234876,,0,0,0,4.278455126234876,175.75311631023976,,0,0,0,175.75311631023976,61.4213366973804,,0,0,0,61.4213366973804,33.7962091509213,,0,0,0,33.7962091509213,118.73163441741592,,0,0,0,118.73163441741592
48,LEU,8.679140447008548,,0,0,0,8.679140447008548,4.538086453521478,,0,0,0,4.538086453521478,176.49930987155622,,0,0,0,176.49930987155622,53.67727128876124,,0,0,0,53.67727128876124,41.46781513745144,,0,0,0,41.46781513745144,128.27963992556886,,0,0,0,128.27963992556886
49,PRO,,,0,0,0,,4.073797908322233,,0,0,0,4.073797908322233,177.8850774383228,,0,0,0,177.8850774383228,65.80545576728271,,0,0,0,65.80545576728271,31.713783592019094,,0,0,0,31.713783592019094,,,0,0,0,
50,ARG,8.43735299016539,,0,0,0,8.43735299016539,4.121830695720946,,0,0,0,4.121830695720946,177.08839832323233,,0,0,0,177.08839832323233,57.74448148458208,,0,0,0,57.74448148458208,29.864712011205462,,0,0,0,29.864712011205462,116.51273723686313,,0,0,0,116.51273723686313
51,GLY,8.096504107220557,,0,0,0,8.096504107220557,3.9927724091963586,,0,0,0,3.9927724091963586,173.84752401989678,,0,0,0,173.84752401989678,45.18162319556555,,0,0,0,45.18162319556555,,,0,0,0,,107.33834769029859,,0,0,0,107.33834769029859
52,GLN,7.582099917654569,,0,0,0,7.582099917654569,4.725129299095349,,0,0,0,4.725129299095349,174.85503806516817,,0,0,0,174.85503806516817,55.66974093493729,,0,0,0,55.66974093493729,30.17268292978688,,0,0,0,30.17268292978688,120.24420018112443,,0,0,0,120.24420018112443
53,LYS,8.98093360992896,,0,0,0,8.98093360992896,4.761968215440116,,0,0,0,4.761968215440116,175.49595742584637,,0,0,0,175.49595742584637,55.2099761520424,,0,0,0,55.2099761520424,33.877848700677106,,0,0,0,33.877848700677106,123.92668088277834,,0,0,0,123.92668088277834
54,LEU,9.02326374039294,,0,0,0,9.02326374039294,5.152632498240648,,0,0,0,5.152632498240648,175.44462646978576,,0,0,0,175.44462646978576,54.340515840648244,,0,0,0,54.340515840648244,44.48953772282162,,0,0,0,44.48953772282162,125.98141764818514,,0,0,0,125.98141764818514
55,ILE,9.145972294461092,,0,0,0,9.145972294461092,5.155254423670773,,0,0,0,5.155254423670773,175.3412963424409,,0,0,0,175.3412963424409,59.89342274938395,,0,0,0,59.89342274938395,41.07305085093795,,0,0,0,41.07305085093795,123.06472011562327,,0,0,0,123.06472011562327
56,PHE,9.340575834820736,,0,0,0,9.340575834820736,5.195848964074813,,0,0,0,5.195848964074813,174.78874617128983,,0,0,0,174.78874617128983,56.503528510089915,,0,0,0,56.503528510089915,42.77743379418914,,0,0,0,42.77743379418914,127.66714800834166,,0,0,0,127.66714800834166
57,LYS,8.96876022084027,,0,0,0,8.96876022084027,3.5710853609251854,,0,0,0,3.5710853609251854,176.2969740585803,,0,0,0,176.2969740585803,57.2646227974803,,0,0,0,57.2646227974803,30.721798126379177,,0,0,0,30.721798126379177,128.75364207826064,,0,0,0,128.75364207826064
58,GLY,8.516988677616828,,0,0,0,8.516988677616828,3.7939817735375736,,0,0,0,3.7939817735375736,173.9082080564269,,0,0,0,173.9082080564269,45.32214303084138,,0,0,0,45.32214303084138,,,0,0,0,,103.7090182607337,,0,0,0,103.7090182607337
59,LYS,7.723212791869241,,0,0,0,7.723212791869241,4.66798975994561,,0,0,0,4.66798975994561,175.37625348641913,,0,0,0,175.37625348641913,54.40507118685204,,0,0,0,54.40507118685204,34.61655618089134,,0,0,0,34.61655618089134,121.57833597400378,,0,0,0,121.57833597400378
60,VAL,8.665994188361639,,0,0,0,8.665994188361639,4.425637408164058,,0,0,0,4.425637408164058,176.57823201446334,,0,0,0,176.57823201446334,62.579648498668,,0,0,0,62.579648498668,32.228230414613165,,0,0,0,32.228230414613165,124.57855476652237,,0,0,0,124.57855476652237
61,LEU,8.605534184360085,,0,0,0,8.605534184360085,4.444117285858586,,0,0,0,4.444117285858586,176.26245786365857,,0,0,0,176.26245786365857,54.85562806876457,,0,0,0,54.85562806876457,42.037405942529695,,0,0,0,42.037405942529695,128.98205664131424,,0,0,0,128.98205664131424
62,VAL,8.259001993217893,,0,0,0,8.259001993217893,4.081081726279276,,0,0,0,4.081081726279276,177.13840745659343,,0,0,0,177.13840745659343,61.72143276663337,,0,0,0,61.72143276663337,32.83864942388167,,0,0,0,32.83864942388167,121.76280763076923,,0,0,0,121.76280763076923
63,GLU,9.025870757153957,,0,0,0,9.025870757153957,3.9655695423937174,,0,0,0,3.9655695423937174,177.09079783358862,,0,0,0,177.09079783358862,58.904644992546345,,0,0,0,58.904644992546345,29.72809572999778,,0,0,0,29.72809572999778,126.21683226322011,,0,0,0,126.21683226322011
64,THR,7.577474006909757,,0,0,0,7.577474006909757,4.295065722838272,,0,0,0,4.295065722838272,175.03806868948828,,0,0,0,175.03806868948828,61.58982779237429,,0,0,0,61.58982779237429,69.10481584164724,,0,0,0,69.10481584164724,106.44209097030192,,0,0,0,106.44209097030192
65,SER,7.863439792202243,,0,0,0,7.863439792202243,4.638847677278277,,0,0,0,4.638847677278277,174.48764092660673,,0,0,0,174.48764092660673,58.66910115190365,,0,0,0,58.66910115190365,64.139153402442,,0,0,0,64.139153402442,119.28991701646687,,0,0,0,119.28991701646687
66,THR,8.632698365917417,,0,0,0,8.632698365917417,4.785781417205017,,0,0,0,4.785781417205017,177.23692774789097,,0,0,0,177.23692774789097,60.91675493795648,,0,0,0,60.91675493795648,71.06307523843934,,0,0,0,71.06307523843934,113.98986515921855,,0,0,0,113.98986515921855
67,LEU,8.830040743140193,,0,0,0,8.830040743140193,3.9052021953019205,,0,0,0,3.9052021953019205,178.82600410406815,,0,0,0,178.82600410406815,58.095401385642134,,0,0,0,58.095401385642134,41.434981822599624,,0,0,0,41.434981822599624,122.5671587507548,,0,0,0,122.5671587507548
68,LYS,8.297997666577865,,0,0,0,8.297997666577865,3.9044687426351428,,0,0,0,3.9044687426351428,178.81160715826397,,0,0,0,178.81160715826397,59.067367842030194,,0,0,0,59.067367842030194,32.422473977428126,,0,0,0,32.422473977428126,120.00432363570319,,0,0,0,120.00432363570319
69,GLN,8.045766874214674,,0,0,0,8.045766874214674,4.136859559085359,,0,0,0,4.136859559085359,177.1939352848485,,0,0,0,177.1939352848485,57.668898116389165,,0,0,0,57.668898116389165,28.653477692224442,,0,0,0,28.653477692224442,118.78335333903874,,0,0,0,118.78335333903874
70,SER,7.806962520623821,,0,0,0,7.806962520623821,4.5083160694749695,,0,0,0,4.5083160694749695,174.059595952775,,0,0,0,174.059595952775,58.41635265333555,,0,0,0,58.41635265333555,64.00281370639915,,0,0,0,64.00281370639915,111.91384592440338,,0,0,0,111.91384592440338
71,ASP,8.028055999528249,,0,0,0,8.028055999528249,4.399606239083139,,0,0,0,4.399606239083139,175.1846554970807,,0,0,0,175.1846554970807,55.525616250366305,,0,0,0,55.525616250366305,39.66440293705739,,0,0,0,39.66440293705739,118.32863961264847,,0,0,0,118.32863961264847
72,VAL,7.99845531008436,,0,0,0,7.99845531008436,3.470019312695638,,0,0,0,3.470019312695638,174.69388811375848,,0,0,0,174.69388811375848,62.632995382450886,,0,0,0,62.632995382450886,30.700301894533244,,0,0,0,30.700301894533244,120.37167247591297,,0,0,0,120.37167247591297
73,GLY,7.967508927311577,,0,0,0,7.967508927311577,4.083083500918526,,0,0,0,4.083083500918526,173.42834013321124,,0,0,0,173.42834013321124,44.12584619706405,,0,0,0,44.12584619706405,,,0,0,0,,113.85287762066822,,0,0,0,113.85287762066822
74,SER,8.44527248801199,,0,0,0,8.44527248801199,4.229476746142746,,0,0,0,4.229476746142746,176.09318143096348,,0,0,0,176.09318143096348,60.129805442307685,,0,0,0,60.129805442307685,63.05118507066822,,0,0,0,63.05118507066822,114.15406883241758,,0,0,0,114.15406883241758
75,GLY,9.11980346125541,,0,0,0,9.11980346125541,3.9753588729520475,,0,0,0,3.9753588729520475,174.64460842056832,,0,0,0,174.64460842056832,45.31071042943168,,0,0,0,45.31071042943168,,,0,0,0,,115.10841657819957,,0,0,0,115.10841657819957
76,ALA,7.766146787684538,,0,0,0,7.766146787684538,4.286729926676102,,0,0,0,4.286729926676102,175.81675458860585,,0,0,0,175.81675458860585,53.0609317977245,,0,0,0,53.0609317977245,19.894682310750362,,0,0,0,19.894682310750362,124.30258130699855,,0,0,0,124.30258130699855
77,LYS,8.58599710106005,,0,0,0,8.58599710106005,5.176679264391163,,0,0,0,5.176679264391163,175.9173886576146,,0,0,0,175.9173886576146,55.2746618930847,,0,0,0,55.2746618930847,33.48846095785326,,0,0,0,33.48846095785326,121.67164532960929,,0,0,0,121.67164532960929
78,LEU,9.15473505887446,,0,0,0,9.15473505887446,5.172395258058608,,0,0,0,5.172395258058608,175.65497982092907,,0,0,0,175.65497982092907,53.39428755846931,,0,0,0,53.39428755846931,44.22154454372294,,0,0,0,44.22154454372294,125.75143984778555,,0,0,0,125.75143984778555
79,MET,9.359020714607615,,0,0,0,9.359020714607615,5.097458287112886,,0,0,0,5.097458287112886,174.60637136288713,,0,0,0,174.60637136288713,54.46241148524808,,0,0,0,54.46241148524808,34.416036472455325,,0,0,0,34.416036472455325,122.07665154140858,,0,0,0,122.07665154140858
80,LEU,9.162802721056721,,0,0,0,9.162802721056721,5.124073061976912,,0,0,0,5.124073061976912,174.8494699600788,,0,0,0,174.8494699600788,53.55319843764569,,0,0,0,53.55319843764569,43.450105881979134,,0,0,0,43.450105881979134,128.65012950082695,,0,0,0,128.65012950082695
81,MET,9.288840393245643,,0,0,0,9.288840393245643,4.939977421711622,,0,0,0,4.939977421711622,174.64687039603731,,0,0,0,174.64687039603731,54.44831390776445,,0,0,0,54.44831390776445,34.50393603436009,,0,0,0,34.50393603436009,127.79617925503385,,0,0,0,127.79617925503385
82,ALA,8.92290068903319,,0,0,0,8.92290068903319,5.22087016976912,,0,0,0,5.22087016976912,177.01364059488844,,0,0,0,177.01364059488844,50.21402642103452,,0,0,0,50.21402642103452,21.20184091954712,,0,0,0,21.20184091954712,129.23640871099457,,0,0,0,129.23640871099457
83,SER,8.461803004123654,,0,0,0,8.461803004123654,4.5442836100510595,,0,0,0,4.5442836100510595,174.14550262363747,,0,0,0,174.14550262363747,58.09560399286824,,0,0,0,58.09560399286824,63.90916475615495,,0,0,0,63.90916475615495,117.71742758117993,,0,0,0,117.71742758117993
84,GLN,8.42313874045954,,0,0,0,8.42313874045954,4.262360567543568,,0,0,0,4.262360567543568,176.00411071834833,,0,0,0,176.00411071834833,56.01007555892441,,0,0,0,56.01007555892441,29.247090588605836,,0,0,0,29.247090588605836,123.6987032042846,,0,0,0,123.6987032042846
85,GLY,8.109488373498724,,0,0,0,8.109488373498724,3.911132076068376,,0,0,0,3.911132076068376,175.66996550127095,,0,0,0,175.66996550127095,45.73976042738928,,0,0,0,45.73976042738928,,,0,0,0,,113.40639881182706,,0,0,0,113.40639881182706
