RESNUM,RESNAME,H_X,H_Y,H_BEST_REF_SCORE,H_BEST_REF_COV,H_BEST_REF_MATCH,H_UCBShift,HA_X,HA_Y,HA_BEST_REF_SCORE,HA_BEST_REF_COV,HA_BEST_REF_MATCH,HA_UCBShift,C_X,C_Y,C_BEST_REF_SCORE,C_BEST_REF_COV,C_BEST_REF_MATCH,C_UCBShift,CA_X,CA_Y,CA_BEST_REF_SCORE,CA_BEST_REF_COV,CA_BEST_REF_MATCH,CA_UCBShift,CB_X,CB_Y,CB_BEST_REF_SCORE,CB_BEST_REF_COV,CB_BEST_REF_MATCH,CB_UCBShift,N_X,N_Y,N_BEST_REF_SCORE,N_BEST_REF_COV,N_BEST_REF_MATCH,N_UCBShift
1,MET,8.286901729781329,,0,0,0,8.286901729781329,4.35371267055722,,0,0,0,4.35371267055722,175.45772311364192,,0,0,0,175.45772311364192,55.74745672465312,,0,0,0,55.74745672465312,32.187622728693526,,0,0,0,32.187622728693526,121.25704645889665,,0,0,0,121.25704645889665
2,GLY,8.415778991658343,,0,0,0,8.415778991658343,3.9160451532162286,,0,0,0,3.9160451532162286,174.21420067903765,,0,0,0,174.21420067903765,45.0715728470474,,0,0,0,45.0715728470474,,,0,0,0,,111.6317806479798,,0,0,0,111.6317806479798
3,ASN,8.294714261682762,,0,0,0,8.294714261682762,4.70863644967255,,0,0,0,4.70863644967255,175.21346762970916,,0,0,0,175.21346762970916,52.995890552619606,,0,0,0,52.995890552619606,38.21566906184926,,0,0,0,38.21566906184926,120.6802271454379,,0,0,0,120.6802271454379
4,GLY,8.009190672422022,,0,0,0,8.009190672422022,4.005076419008769,,0,0,0,4.005076419008769,174.32006289634256,,0,0,0,174.32006289634256,45.09310510466756,,0,0,0,45.09310510466756,,,0,0,0,,110.5305072007215,,0,0,0,110.5305072007215
5,GLU,8.48891179048729,,0,0,0,8.48891179048729,4.244762292474192,,0,0,0,4.244762292474192,176.07154383689644,,0,0,0,176.07154383689644,56.37691117539683,,0,0,0,56.37691117539683,29.195369304995005,,0,0,0,29.195369304995005,122.23380455916862,,0,0,0,122.23380455916862
6,THR,7.945324925063825,,0,0,0,7.945324925063825,4.349008894594294,,0,0,0,4.349008894594294,174.43907089141413,,0,0,0,174.43907089141413,61.667382800399594,,0,0,0,61.667382800399594,69.47669716665001,,0,0,0,69.47669716665001,115.77170696819292,,0,0,0,115.77170696819292
7,SER,8.349768664829615,,0,0,0,8.349768664829615,4.435382857015207,,0,0,0,4.435382857015207,173.98986791816517,,0,0,0,173.98986791816517,58.871165480203125,,0,0,0,58.871165480203125,63.607926656249305,,0,0,0,63.607926656249305,120.05267821609502,,0,0,0,120.05267821609502
8,ASP,8.34891434026529,,0,0,0,8.34891434026529,4.808046454284604,,0,0,0,4.808046454284604,175.61577054151405,,0,0,0,175.61577054151405,53.483501309906764,,0,0,0,53.483501309906764,42.73455227491398,,0,0,0,42.73455227491398,124.15838600988457,,0,0,0,124.15838600988457
9,LEU,8.656721436890887,,0,0,0,8.656721436890887,4.458654876789877,,0,0,0,4.458654876789877,176.49696643707404,,0,0,0,176.49696643707404,54.03428115942391,,0,0,0,54.03428115942391,42.79915095174825,,0,0,0,42.79915095174825,125.13252942984792,,0,0,0,125.13252942984792
10,GLU,8.30141523152403,,0,0,0,8.30141523152403,4.254008464774115,,0,0,0,4.254008464774115,175.02141509049284,,0,0,0,175.02141509049284,54.17162212122322,,0,0,0,54.17162212122322,29.00176549149184,,0,0,0,29.00176549149184,120.0340993558719,,0,0,0,120.0340993558719
11,PRO,,,0,0,0,,4.35584220001665,,0,0,0,4.35584220001665,175.5872231996004,,0,0,0,175.5872231996004,62.38672916368076,,0,0,0,62.38672916368076,32.070966903424356,,0,0,0,32.070966903424356,,,0,0,0,
12,LYS,8.722417484326783,,0,0,0,8.722417484326783,4.501601464951715,,0,0,0,4.501601464951715,175.7994204925297,,0,0,0,175.7994204925297,55.41133303564214,,0,0,0,55.41133303564214,32.99132495235875,,0,0,0,32.99132495235875,122.009691741231,,0,0,0,122.009691741231
13,LEU,8.82525545976801,,0,0,0,8.82525545976801,4.891675800172051,,0,0,0,4.891675800172051,176.1114945558608,,0,0,0,176.1114945558608,54.53390607112332,,0,0,0,54.53390607112332,44.018052182523036,,0,0,0,44.018052182523036,130.20568281674437,,0,0,0,130.20568281674437
14,THR,8.961050697019648,,0,0,0,8.961050697019648,4.58530239029304,,0,0,0,4.58530239029304,173.4159737497003,,0,0,0,173.4159737497003,61.37598754654234,,0,0,0,61.37598754654234,70.3091440585803,,0,0,0,70.3091440585803,121.52384699512709,,0,0,0,121.52384699512709
15,VAL,8.484492744472194,,0,0,0,8.484492744472194,4.270354813120213,,0,0,0,4.270354813120213,173.66370131666667,,0,0,0,173.66370131666667,58.9105853018093,,0,0,0,58.9105853018093,34.00151667051837,,0,0,0,34.00151667051837,127.26123283848374,,0,0,0,127.26123283848374
16,PRO,,,0,0,0,,4.497566767105117,,0,0,0,4.497566767105117,177.06760167210567,,0,0,0,177.06760167210567,62.84061831416361,,0,0,0,62.84061831416361,32.357678274048176,,0,0,0,32.357678274048176,,,0,0,0,
17,VAL,8.336292803124653,,0,0,0,8.336292803124653,4.132059813716839,,0,0,0,4.132059813716839,176.48406809821844,,0,0,0,176.48406809821844,63.74354733049174,,0,0,0,63.74354733049174,32.451349994727494,,0,0,0,32.451349994727494,119.1932315547841,,0,0,0,119.1932315547841
18,GLY,7.806268840442891,,0,0,0,7.806268840442891,4.0818506611582865,,0,0,0,4.0818506611582865,172.52922766919747,,0,0,0,172.52922766919747,45.68765185417916,,0,0,0,45.68765185417916,,,0,0,0,,109.19520092794983,,0,0,0,109.19520092794983
19,ALA,8.79797732807748,,0,0,0,8.79797732807748,4.879450306066157,,0,0,0,4.879450306066157,175.51407406192698,,0,0,0,175.51407406192698,50.94902512937618,,0,0,0,50.94902512937618,22.83000618903874,,0,0,0,22.83000618903874,123.32664012739482,,0,0,0,123.32664012739482
20,THR,8.384259741636143,,0,0,0,8.384259741636143,5.339387533166834,,0,0,0,5.339387533166834,173.95058348560326,,0,0,0,173.95058348560326,61.42516088229548,,0,0,0,61.42516088229548,70.40637863026419,,0,0,0,70.40637863026419,116.5243258036297,,0,0,0,116.5243258036297
21,ILE,8.804117993090243,,0,0,0,8.804117993090243,4.829249401837052,,0,0,0,4.829249401837052,173.58668735931292,,0,0,0,173.58668735931292,59.58921254953935,,0,0,0,59.58921254953935,41.74658987967588,,0,0,0,41.74658987967588,123.09604144637031,,0,0,0,123.09604144637031
22,HIS,8.763083029353979,,0,0,0,8.763083029353979,5.234662277983128,,0,0,0,5.234662277983128,175.48225410569984,,0,0,0,175.48225410569984,55.18657005984571,,0,0,0,55.18657005984571,31.46232922105117,,0,0,0,31.46232922105117,118.83489976283717,,0,0,0,118.83489976283717
23,VAL,8.567318274997223,,0,0,0,8.567318274997223,3.738953957359307,,0,0,0,3.738953957359307,177.33097776676658,,0,0,0,177.33097776676658,65.12180954004884,,0,0,0,65.12180954004884,31.674401792030192,,0,0,0,31.674401792030192,121.28486121211012,,0,0,0,121.28486121211012
24,GLY,9.051695438933288,,0,0,0,9.051695438933288,3.9969104240842492,,0,0,0,3.9969104240842492,174.53517168956046,,0,0,0,174.53517168956046,45.06531347984793,,0,0,0,45.06531347984793,,,0,0,0,,116.76740835949606,,0,0,0,116.76740835949606
25,ASP,8.0605740510212,,0,0,0,8.0605740510212,4.745158644666445,,0,0,0,4.745158644666445,175.88460310940727,,0,0,0,175.88460310940727,54.16860082224998,,0,0,0,54.16860082224998,42.531628309074264,,0,0,0,42.531628309074264,122.05180574939506,,0,0,0,122.05180574939506
26,SER,8.500044132733933,,0,0,0,8.500044132733933,4.526064399139749,,0,0,0,4.526064399139749,174.05116209815185,,0,0,0,174.05116209815185,57.990106198185146,,0,0,0,57.990106198185146,63.72669518326673,,0,0,0,63.72669518326673,117.6085388897547,,0,0,0,117.6085388897547
27,PHE,8.636929684149184,,0,0,0,8.636929684149184,4.737722121839272,,0,0,0,4.737722121839272,174.26819071183817,,0,0,0,174.26819071183817,57.7476303996226,,0,0,0,57.7476303996226,40.42399704050949,,0,0,0,40.42399704050949,123.41178755684871,,0,0,0,123.41178755684871
28,VAL,7.676641399450549,,0,0,0,7.676641399450549,4.324038092077368,,0,0,0,4.324038092077368,174.63159284547675,,0,0,0,174.63159284547675,58.65199328443778,,0,0,0,58.65199328443778,32.30911505536131,,0,0,0,32.30911505536131,127.57309061374737,,0,0,0,127.57309061374737
29,PRO,,,0,0,0,,4.224272843656344,,0,0,0,4.224272843656344,177.2263033522644,,0,0,0,177.2263033522644,64.33570863424353,,0,0,0,64.33570863424353,32.05589911656677,,0,0,0,32.05589911656677,,,0,0,0,
30,MET,8.033551236002886,,0,0,0,8.033551236002886,4.54216712012987,,0,0,0,4.54216712012987,176.802310148335,,0,0,0,176.802310148335,55.554788538128534,,0,0,0,55.554788538128534,32.20298523289488,,0,0,0,32.20298523289488,113.45580302919856,,0,0,0,113.45580302919856
31,ALA,7.602964960855811,,0,0,0,7.602964960855811,4.081212906562882,,0,0,0,4.081212906562882,178.65384956021757,,0,0,0,178.65384956021757,54.46673775074925,,0,0,0,54.46673775074925,18.631026752802754,,0,0,0,18.631026752802754,123.59248333146853,,0,0,0,123.59248333146853
32,GLU,8.339426613231213,,0,0,0,8.339426613231213,4.322531066211566,,0,0,0,4.322531066211566,175.71966880615494,,0,0,0,175.71966880615494,56.498929382001336,,0,0,0,56.498929382001336,29.69957059200244,,0,0,0,29.69957059200244,114.55139091343656,,0,0,0,114.55139091343656
33,VAL,7.278503891896991,,0,0,0,7.278503891896991,4.548839242496392,,0,0,0,4.548839242496392,175.1348782970363,,0,0,0,175.1348782970363,62.14886685925186,,0,0,0,62.14886685925186,33.002885486624486,,0,0,0,33.002885486624486,120.31589637500278,,0,0,0,120.31589637500278
34,LEU,8.793630818520368,,0,0,0,8.793630818520368,4.720615771933622,,0,0,0,4.720615771933622,175.32626429261293,,0,0,0,175.32626429261293,53.5039686476135,,0,0,0,53.5039686476135,46.250572992318794,,0,0,0,46.250572992318794,127.15659192682872,,0,0,0,127.15659192682872
35,ALA,9.232404056265956,,0,0,0,9.232404056265956,5.163714321206572,,0,0,0,5.163714321206572,175.6893634009435,,0,0,0,175.6893634009435,50.135208581041184,,0,0,0,50.135208581041184,21.299677231596185,,0,0,0,21.299677231596185,125.16993041383616,,0,0,0,125.16993041383616
36,ILE,8.776021647258297,,0,0,0,8.776021647258297,4.784853352680653,,0,0,0,4.784853352680653,174.98977438637473,,0,0,0,174.98977438637473,59.471622820068816,,0,0,0,59.471622820068816,39.7968214499334,,0,0,0,39.7968214499334,123.79644655942391,,0,0,0,123.79644655942391
37,ASP,8.790488551132201,,0,0,0,8.790488551132201,4.939178307270507,,0,0,0,4.939178307270507,177.02690306235434,,0,0,0,177.02690306235434,53.105555710828064,,0,0,0,53.105555710828064,43.3247640964147,,0,0,0,43.3247640964147,129.0519529032634,,0,0,0,129.0519529032634
38,LYS,8.85205143157953,,0,0,0,8.85205143157953,4.139769150130425,,0,0,0,4.139769150130425,177.6943938142524,,0,0,0,177.6943938142524,58.22555967649573,,0,0,0,58.22555967649573,32.37770439331224,,0,0,0,32.37770439331224,124.35424341833168,,0,0,0,124.35424341833168
39,GLU,8.129364814602065,,0,0,0,8.129364814602065,4.321005093539793,,0,0,0,4.321005093539793,177.47580363332222,,0,0,0,177.47580363332222,57.921776654545454,,0,0,0,57.921776654545454,30.53761959266844,,0,0,0,30.53761959266844,116.92363535719281,,0,0,0,116.92363535719281
40,ASP,8.393215831940282,,0,0,0,8.393215831940282,4.724945203860029,,0,0,0,4.724945203860029,176.3074655972139,,0,0,0,176.3074655972139,54.563735845632145,,0,0,0,54.563735845632145,41.53984523082473,,0,0,0,41.53984523082473,118.90387382620713,,0,0,0,118.90387382620713
41,GLY,7.784252135969585,,0,0,0,7.784252135969585,4.074034182958709,,0,0,0,4.074034182958709,173.64004334010434,,0,0,0,173.64004334010434,45.070159614047064,,0,0,0,45.070159614047064,,,0,0,0,,108.96818672015762,,0,0,0,108.96818672015762
42,ASP,8.519591012570762,,0,0,0,8.519591012570762,4.73181090980131,,0,0,0,4.73181090980131,177.09552858276726,,0,0,0,177.09552858276726,54.66285161735487,,0,0,0,54.66285161735487,40.768742273665225,,0,0,0,40.768742273665225,124.70227077193918,,0,0,0,124.70227077193918
43,LEU,8.674306656993007,,0,0,0,8.674306656993007,4.460365151909202,,0,0,0,4.460365151909202,178.18798712823843,,0,0,0,178.18798712823843,54.724651577494726,,0,0,0,54.724651577494726,42.21359259045954,,0,0,0,42.21359259045954,127.29475287843267,,0,0,0,127.29475287843267
44,THR,8.10644379997225,,0,0,0,8.10644379997225,4.025574691905316,,0,0,0,4.025574691905316,176.64230214262957,,0,0,0,176.64230214262957,65.64201630314685,,0,0,0,65.64201630314685,68.66352587938172,,0,0,0,68.66352587938172,117.15895655266955,,0,0,0,117.15895655266955
45,SER,8.240074623226773,,0,0,0,8.240074623226773,4.28887957988678,,0,0,0,4.28887957988678,175.52407402932067,,0,0,0,175.52407402932067,60.127645495454544,,0,0,0,60.127645495454544,62.867356465950714,,0,0,0,62.867356465950714,115.34151707440893,,0,0,0,115.34151707440893
46,LYS,7.695111457109556,,0,0,0,7.695111457109556,4.3869665144577645,,0,0,0,4.3869665144577645,176.60660838115217,,0,0,0,176.60660838115217,55.99326274635365,,0,0,0,55.99326274635365,33.049544732905986,,0,0,0,33.049544732905986,120.53535086068932,,0,0,0,120.53535086068932
47,ILE,7.102976855550004,,0,0,0,7.102976855550004,3.948380748962149,,0,0,0,3.948380748962149,175.40580746209346,,0,0,0,175.40580746209346,62.77706021441892,,0,0,0,62.77706021441892,38.26089089679765,,0,0,0,38.26089089679765,120.8007911510434,,0,0,0,120.8007911510434
48,LYS,8.776153328255077,,0,0,0,8.776153328255077,4.6984284178710185,,0,0,0,4.6984284178710185,175.1339803532634,,0,0,0,175.1339803532634,55.373434684426684,,0,0,0,55.373434684426684,33.81546673712399,,0,0,0,33.81546673712399,128.58443251413587,,0,0,0,128.58443251413587
49,VAL,8.766000115395714,,0,0,0,8.766000115395714,4.412373056404706,,0,0,0,4.412373056404706,175.3949749535964,,0,0,0,175.3949749535964,61.325549219158624,,0,0,0,61.325549219158624,32.82618778669109,,0,0,0,32.82618778669109,126.47772088043068,,0,0,0,126.47772088043068
50,ASP,8.837892562187813,,0,0,0,8.837892562187813,4.848123145593296,,0,0,0,4.848123145593296,175.5581708527417,,0,0,0,175.5581708527417,53.22023333989899,,0,0,0,53.22023333989899,43.46154921201577,,0,0,0,43.46154921201577,127.67696416774892,,0,0,0,127.67696416774892
51,GLY,8.5666994494894,,0,0,0,8.5666994494894,4.030646200668776,,0,0,0,4.030646200668776,173.1057723387668,,0,0,0,173.1057723387668,44.74468281822622,,0,0,0,44.74468281822622,,,0,0,0,,111.96596851666666,,0,0,0,111.96596851666666
52,GLU,8.35000815028305,,0,0,0,8.35000815028305,4.496198848354424,,0,0,0,4.496198848354424,175.2790771677489,,0,0,0,175.2790771677489,55.62245236935842,,0,0,0,55.62245236935842,31.383618846325895,,0,0,0,31.383618846325895,119.98883007130647,,0,0,0,119.98883007130647
53,VAL,8.231565365606615,,0,0,0,8.231565365606615,3.5489569713064713,,0,0,0,3.5489569713064713,174.65367492417582,,0,0,0,174.65367492417582,61.81280495897436,,0,0,0,61.81280495897436,32.43574247445332,,0,0,0,32.43574247445332,122.06832504760796,,0,0,0,122.06832504760796
54,ASP,6.510748672732823,,0,0,0,6.510748672732823,4.582837838422688,,0,0,0,4.582837838422688,176.09749542552447,,0,0,0,176.09749542552447,52.79103413520369,,0,0,0,52.79103413520369,40.610080875341325,,0,0,0,40.610080875341325,127.40293545692641,,0,0,0,127.40293545692641
55,THR,8.093133604168054,,0,0,0,8.093133604168054,4.067497449028749,,0,0,0,4.067497449028749,175.40375775784216,,0,0,0,175.40375775784216,63.179971767654564,,0,0,0,63.179971767654564,68.5920870962038,,0,0,0,68.5920870962038,115.23228500313574,,0,0,0,115.23228500313574
56,THR,7.8164628331612835,,0,0,0,7.8164628331612835,4.275908152591852,,0,0,0,4.275908152591852,174.62910694204683,,0,0,0,174.62910694204683,62.93156842470862,,0,0,0,62.93156842470862,69.30801596144411,,0,0,0,69.30801596144411,112.8315961063825,,0,0,0,112.8315961063825
57,LYS,7.475044534676433,,0,0,0,7.475044534676433,4.552368597641248,,0,0,0,4.552368597641248,175.40484938508158,,0,0,0,175.40484938508158,55.26293033468199,,0,0,0,55.26293033468199,34.72445515992896,,0,0,0,34.72445515992896,122.7111890878455,,0,0,0,122.7111890878455
58,ALA,8.60489058929404,,0,0,0,8.60489058929404,4.278350022261073,,0,0,0,4.278350022261073,177.50929151011766,,0,0,0,177.50929151011766,52.524098877244974,,0,0,0,52.524098877244974,19.306858073715176,,0,0,0,19.306858073715176,127.0109584546509,,0,0,0,127.0109584546509
59,GLY,8.721731016477966,,0,0,0,8.721731016477966,4.024065621189922,,0,0,0,4.024065621189922,171.90903636521256,,0,0,0,171.90903636521256,44.905478344400045,,0,0,0,44.905478344400045,,,0,0,0,,108.97380000067155,,0,0,0,108.97380000067155
60,THR,8.248587567632368,,0,0,0,8.248587567632368,5.0458362309357305,,0,0,0,5.0458362309357305,173.282077519647,,0,0,0,173.282077519647,62.09090727671217,,0,0,0,62.09090727671217,69.49677822634588,,0,0,0,69.49677822634588,117.13942922915973,,0,0,0,117.13942922915973
61,TYR,9.136486126523476,,0,0,0,9.136486126523476,4.791889049439449,,0,0,0,4.791889049439449,174.48620619040403,,0,0,0,174.48620619040403,57.03946899546009,,0,0,0,57.03946899546009,41.56845971436896,,0,0,0,41.56845971436896,126.521999517316,,0,0,0,126.521999517316
62,VAL,8.644479522366522,,0,0,0,8.644479522366522,4.984280122222222,,0,0,0,4.984280122222222,175.44176696183263,,0,0,0,175.44176696183263,61.08276227465313,,0,0,0,61.08276227465313,33.51638283865024,,0,0,0,33.51638283865024,122.14982492060162,,0,0,0,122.14982492060162
63,LEU,9.36205039971695,,0,0,0,9.36205039971695,5.010923178893329,,0,0,0,5.010923178893329,175.6535790449384,,0,0,0,175.6535790449384,52.820927905039404,,0,0,0,52.820927905039404,44.267641794788545,,0,0,0,44.267641794788545,128.6228635525863,,0,0,0,128.6228635525863
64,THR,8.778693385248086,,0,0,0,8.778693385248086,5.0605409925241425,,0,0,0,5.0605409925241425,173.34600778571982,,0,0,0,173.34600778571982,61.98472681117771,,0,0,0,61.98472681117771,69.90842274401709,,0,0,0,69.90842274401709,117.74284509423354,,0,0,0,117.74284509423354
65,TYR,9.295279463247862,,0,0,0,9.295279463247862,5.144049261527362,,0,0,0,5.144049261527362,174.95389523488734,,0,0,0,174.95389523488734,56.43265966872016,,0,0,0,56.43265966872016,40.328372446187146,,0,0,0,40.328372446187146,127.98912666736041,,0,0,0,127.98912666736041
66,THR,9.08274033848929,,0,0,0,9.08274033848929,5.414315799811301,,0,0,0,5.414315799811301,173.8862397140193,,0,0,0,173.8862397140193,61.62011355417915,,0,0,0,61.62011355417915,71.27505247308802,,0,0,0,71.27505247308802,119.72954094688089,,0,0,0,119.72954094688089
67,VAL,9.07057359028194,,0,0,0,9.07057359028194,4.693543985941836,,0,0,0,4.693543985941836,173.44404646768788,,0,0,0,173.44404646768788,59.945633760483965,,0,0,0,59.945633760483965,35.11790183599179,,0,0,0,35.11790183599179,123.04118529053724,,0,0,0,123.04118529053724
68,THR,8.5160248998335,,0,0,0,8.5160248998335,5.115339266444666,,0,0,0,5.115339266444666,174.3290275502109,,0,0,0,174.3290275502109,61.32564863606948,,0,0,0,61.32564863606948,70.72532221386946,,0,0,0,70.72532221386946,121.96762252239427,,0,0,0,121.96762252239427
69,ASP,8.848766960372961,,0,0,0,8.848766960372961,4.788338677811078,,0,0,0,4.788338677811078,177.83062736187148,,0,0,0,177.83062736187148,53.685458341674995,,0,0,0,53.685458341674995,42.88968365921301,,0,0,0,42.88968365921301,126.21382436978578,,0,0,0,126.21382436978578
70,SER,8.911837751948052,,0,0,0,8.911837751948052,4.280993043195693,,0,0,0,4.280993043195693,175.770643699001,,0,0,0,175.770643699001,60.583629979082026,,0,0,0,60.583629979082026,63.08303867480852,,0,0,0,63.08303867480852,117.11049437410922,,0,0,0,117.11049437410922
71,LYS,8.340230557220556,,0,0,0,8.340230557220556,4.320546996237096,,0,0,0,4.320546996237096,177.32478329509934,,0,0,0,177.32478329509934,55.34688677649573,,0,0,0,55.34688677649573,32.130447481185485,,0,0,0,32.130447481185485,120.33989446795982,,0,0,0,120.33989446795982
72,GLY,7.89756519007659,,0,0,0,7.89756519007659,3.9145347510878024,,0,0,0,3.9145347510878024,174.33923826663892,,0,0,0,174.33923826663892,45.52330629476634,,0,0,0,45.52330629476634,,,0,0,0,,108.51945488564769,,0,0,0,108.51945488564769
73,HIS,8.258898566616717,,0,0,0,8.258898566616717,4.476475943795094,,0,0,0,4.476475943795094,174.18335311991342,,0,0,0,174.18335311991342,56.74980738113553,,0,0,0,56.74980738113553,30.064039101015652,,0,0,0,30.064039101015652,119.69249739942835,,0,0,0,119.69249739942835
74,GLU,8.63738644028749,,0,0,0,8.63738644028749,5.320139229059829,,0,0,0,5.320139229059829,175.43690768853924,,0,0,0,175.43690768853924,54.94750005652126,,0,0,0,54.94750005652126,31.855254206193802,,0,0,0,31.855254206193802,125.17581336336441,,0,0,0,125.17581336336441
75,VAL,9.135017406565657,,0,0,0,9.135017406565657,4.633082248368298,,0,0,0,4.633082248368298,174.24898720890778,,0,0,0,174.24898720890778,59.97363178934399,,0,0,0,59.97363178934399,35.195490030369626,,0,0,0,35.195490030369626,123.18664348287268,,0,0,0,123.18664348287268
76,THR,8.455531022233322,,0,0,0,8.455531022233322,5.307475159102009,,0,0,0,5.307475159102009,173.310353172422,,0,0,0,173.310353172422,61.36698958108003,,0,0,0,61.36698958108003,71.79458752336552,,0,0,0,71.79458752336552,120.09957106561771,,0,0,0,120.09957106561771
77,ALA,9.040247343145744,,0,0,0,9.040247343145744,4.878768454961706,,0,0,0,4.878768454961706,175.18719864524365,,0,0,0,175.18719864524365,51.07430447660673,,0,0,0,51.07430447660673,22.996970917193917,,0,0,0,22.996970917193917,127.88067678626373,,0,0,0,127.88067678626373
78,LYS,8.507097084476634,,0,0,0,8.507097084476634,5.335529503984904,,0,0,0,5.335529503984904,175.2976159512321,,0,0,0,175.2976159512321,55.01286532476968,,0,0,0,55.01286532476968,35.443665582017985,,0,0,0,35.443665582017985,120.33938726714952,,0,0,0,120.33938726714952
79,GLN,9.111009377938728,,0,0,0,9.111009377938728,4.861128458064158,,0,0,0,4.861128458064158,174.47260864435563,,0,0,0,174.47260864435563,54.12612119421134,,0,0,0,54.12612119421134,32.52451276898657,,0,0,0,32.52451276898657,123.92574644875124,,0,0,0,123.92574644875124
80,THR,9.339681454229103,,0,0,0,9.339681454229103,4.899250423359973,,0,0,0,4.899250423359973,174.20041890890775,,0,0,0,174.20041890890775,61.84307778556443,,0,0,0,61.84307778556443,69.61576283864468,,0,0,0,69.61576283864468,124.00417307779442,,0,0,0,124.00417307779442
81,VAL,9.268875362909311,,0,0,0,9.268875362909311,4.600087765651016,,0,0,0,4.600087765651016,174.9315217607226,,0,0,0,174.9315217607226,60.834587884165835,,0,0,0,60.834587884165835,32.75365913049728,,0,0,0,32.75365913049728,127.91080855835276,,0,0,0,127.91080855835276
82,THR,8.90931901874237,,0,0,0,8.90931901874237,4.879131261815962,,0,0,0,4.879131261815962,174.00314948020312,,0,0,0,174.00314948020312,61.77496070039405,,0,0,0,61.77496070039405,69.30805030209235,,0,0,0,69.30805030209235,124.16373061134976,,0,0,0,124.16373061134976
83,VAL,9.197565382040182,,0,0,0,9.197565382040182,4.499135841280941,,0,0,0,4.499135841280941,175.94627945729826,,0,0,0,175.94627945729826,61.244118396337,,0,0,0,61.244118396337,32.6003458519869,,0,0,0,32.6003458519869,127.59658892162281,,0,0,0,127.59658892162281
84,LYS,8.831258694039294,,0,0,0,8.831258694039294,4.700033352186702,,0,0,0,4.700033352186702,175.79053686001777,,0,0,0,175.79053686001777,54.90004328399934,,0,0,0,54.90004328399934,34.22995318973804,,0,0,0,34.22995318973804,128.3098817011655,,0,0,0,128.3098817011655
85,VAL,8.535414953885002,,0,0,0,8.535414953885002,4.041528615218115,,0,0,0,4.041528615218115,176.52014120851928,,0,0,0,176.52014120851928,63.11358062612388,,0,0,0,63.11358062612388,32.31453902074592,,0,0,0,32.31453902074592,122.56712927830503,,0,0,0,122.56712927830503
86,ARG,8.451815016627817,,0,0,0,8.451815016627817,4.3010915064990565,,0,0,0,4.3010915064990565,176.94278395532245,,0,0,0,176.94278395532245,56.30853178666889,,0,0,0,56.30853178666889,30.89990091061716,,0,0,0,30.89990091061716,125.98234478089688,,0,0,0,125.98234478089688
87,GLU,8.641061104634254,,0,0,0,8.641061104634254,4.208665992368742,,0,0,0,4.208665992368742,176.00890035263623,,0,0,0,176.00890035263623,56.57949740496171,,0,0,0,56.57949740496171,29.322606539665887,,0,0,0,29.322606539665887,123.83388736827062,,0,0,0,123.83388736827062
88,GLU,8.225697928382727,,0,0,0,8.225697928382727,4.218850234287934,,0,0,0,4.218850234287934,176.20670000009434,,0,0,0,176.20670000009434,56.3061091023199,,0,0,0,56.3061091023199,29.590787661577313,,0,0,0,29.590787661577313,122.4988840418193,,0,0,0,122.4988840418193
89,VAL,8.038815175707626,,0,0,0,8.038815175707626,4.064510178016428,,0,0,0,4.064510178016428,176.46844063805085,,0,0,0,176.46844063805085,62.49761907960373,,0,0,0,62.49761907960373,32.619504651187704,,0,0,0,32.619504651187704,121.91010322072927,,0,0,0,121.91010322072927