RESNUM,RESNAME,H_X,H_Y,H_BEST_REF_SCORE,H_BEST_REF_COV,H_BEST_REF_MATCH,H_UCBShift,HA_X,HA_Y,HA_BEST_REF_SCORE,HA_BEST_REF_COV,HA_BEST_REF_MATCH,HA_UCBShift,C_X,C_Y,C_BEST_REF_SCORE,C_BEST_REF_COV,C_BEST_REF_MATCH,C_UCBShift,CA_X,CA_Y,CA_BEST_REF_SCORE,CA_BEST_REF_COV,CA_BEST_REF_MATCH,CA_UCBShift,CB_X,CB_Y,CB_BEST_REF_SCORE,CB_BEST_REF_COV,CB_BEST_REF_MATCH,CB_UCBShift,N_X,N_Y,N_BEST_REF_SCORE,N_BEST_REF_COV,N_BEST_REF_MATCH,N_UCBShift
1,MET,8.322750331779332,,0,0,0,8.322750331779332,4.740422615351315,,0,0,0,4.740422615351315,172.9241195685592,,0,0,0,172.9241195685592,53.07186846956377,,0,0,0,53.07186846956377,32.573528906754355,,0,0,0,32.573528906754355,121.96118068287824,,0,0,0,121.96118068287824
2,PRO,,,0,0,0,,4.403648323354423,,0,0,0,4.403648323354423,176.96242433053058,,0,0,0,176.96242433053058,62.82469557272172,,0,0,0,62.82469557272172,31.997907552647355,,0,0,0,31.997907552647355,,,0,0,0,
3,HIS,8.590351238150738,,0,0,0,8.590351238150738,4.341902538361638,,0,0,0,4.341902538361638,175.1458002287102,,0,0,0,175.1458002287102,56.48805758302808,,0,0,0,56.48805758302808,28.7547393001554,,0,0,0,28.7547393001554,121.26401624400044,,0,0,0,121.26401624400044
4,LYS,8.125897587767787,,0,0,0,8.125897587767787,4.245755606021756,,0,0,0,4.245755606021756,176.76462788766233,,0,0,0,176.76462788766233,56.19525621767122,,0,0,0,56.19525621767122,32.44460356645022,,0,0,0,32.44460356645022,123.56195710505607,,0,0,0,123.56195710505607
5,GLU,8.392391776817627,,0,0,0,8.392391776817627,4.132101128332779,,0,0,0,4.132101128332779,175.82467011728826,,0,0,0,175.82467011728826,56.652295644438894,,0,0,0,56.652295644438894,29.15500131810967,,0,0,0,29.15500131810967,124.97008810007215,,0,0,0,124.97008810007215
6,LYS,8.089162602863802,,0,0,0,8.089162602863802,4.250692183505383,,0,0,0,4.250692183505383,176.1151159096681,,0,0,0,176.1151159096681,56.01455925985126,,0,0,0,56.01455925985126,33.14698288617494,,0,0,0,33.14698288617494,122.38265952207237,,0,0,0,122.38265952207237
7,HIS,8.31235364209124,,0,0,0,8.31235364209124,4.755205962501387,,0,0,0,4.755205962501387,175.00763026607837,,0,0,0,175.00763026607837,55.15298794462204,,0,0,0,55.15298794462204,30.069940022549673,,0,0,0,30.069940022549673,121.82750216344212,,0,0,0,121.82750216344212
8,PRO,,,0,0,0,,4.3777994195526695,,0,0,0,4.3777994195526695,179.02769148669665,,0,0,0,179.02769148669665,65.55290348075258,,0,0,0,65.55290348075258,32.06194788388279,,0,0,0,32.06194788388279,,,0,0,0,
9,LEU,8.440288662037963,,0,0,0,8.440288662037963,4.158206161882562,,0,0,0,4.158206161882562,178.9137366022089,,0,0,0,178.9137366022089,57.707314173248974,,0,0,0,57.707314173248974,42.111419675269175,,0,0,0,42.111419675269175,118.5099787996892,,0,0,0,118.5099787996892
10,GLN,8.142825545787547,,0,0,0,8.142825545787547,3.8475240326506825,,0,0,0,3.8475240326506825,178.10839838116883,,0,0,0,178.10839838116883,58.93781353161283,,0,0,0,58.93781353161283,28.238486367205017,,0,0,0,28.238486367205017,119.65329054700854,,0,0,0,119.65329054700854
11,ASP,7.968528591952492,,0,0,0,7.968528591952492,4.42170112001332,,0,0,0,4.42170112001332,178.6234027885448,,0,0,0,178.6234027885448,57.26227500405706,,0,0,0,57.26227500405706,40.50382901257076,,0,0,0,40.50382901257076,120.42992836067266,,0,0,0,120.42992836067266
12,MET,8.159057808441558,,0,0,0,8.159057808441558,4.039764617271617,,0,0,0,4.039764617271617,178.12722762027974,,0,0,0,178.12722762027974,59.23373251418582,,0,0,0,59.23373251418582,33.26591425901876,,0,0,0,33.26591425901876,120.61904811585082,,0,0,0,120.61904811585082
13,PHE,8.925148504628705,,0,0,0,8.925148504628705,4.074052017476967,,0,0,0,4.074052017476967,178.37933302058497,,0,0,0,178.37933302058497,62.55899569952825,,0,0,0,62.55899569952825,38.23570359338439,,0,0,0,38.23570359338439,118.06566809028195,,0,0,0,118.06566809028195
14,THR,8.783310217132867,,0,0,0,8.783310217132867,3.926774214091464,,0,0,0,3.926774214091464,175.92308549340103,,0,0,0,175.92308549340103,67.46030848387723,,0,0,0,67.46030848387723,68.49929697295482,,0,0,0,68.49929697295482,117.68626568028083,,0,0,0,117.68626568028083
15,SER,8.344591816544566,,0,0,0,8.344591816544566,4.167695993364968,,0,0,0,4.167695993364968,176.7919046660617,,0,0,0,176.7919046660617,61.27646354420579,,0,0,0,61.27646354420579,62.81913259896215,,0,0,0,62.81913259896215,118.1019334502331,,0,0,0,118.1019334502331
16,ALA,8.046137884382285,,0,0,0,8.046137884382285,3.2282623498751253,,0,0,0,3.2282623498751253,178.90076701788212,,0,0,0,178.90076701788212,54.96264080978466,,0,0,0,54.96264080978466,18.47829340638251,,0,0,0,18.47829340638251,124.88857902882118,,0,0,0,124.88857902882118
17,ILE,8.440144435497835,,0,0,0,8.440144435497835,3.408512966561217,,0,0,0,3.408512966561217,177.6618623852703,,0,0,0,177.6618623852703,66.04833752481962,,0,0,0,66.04833752481962,37.9344372021534,,0,0,0,37.9344372021534,118.94406412531913,,0,0,0,118.94406412531913
18,GLU,8.351469178149628,,0,0,0,8.351469178149628,3.9312780962398715,,0,0,0,3.9312780962398715,178.32873417575757,,0,0,0,178.32873417575757,59.07659437010767,,0,0,0,59.07659437010767,29.617505997968696,,0,0,0,29.617505997968696,119.77689000745366,,0,0,0,119.77689000745366
19,ALA,7.840084178132979,,0,0,0,7.840084178132979,4.071649016444667,,0,0,0,4.071649016444667,179.24438711858141,,0,0,0,179.24438711858141,54.11818681805417,,0,0,0,54.11818681805417,18.292060312265516,,0,0,0,18.292060312265516,120.86147330204795,,0,0,0,120.86147330204795
20,VAL,7.385689447741147,,0,0,0,7.385689447741147,3.8692745888389384,,0,0,0,3.8692745888389384,176.65040986067822,,0,0,0,176.65040986067822,63.9976998493007,,0,0,0,63.9976998493007,32.998178973204574,,0,0,0,32.998178973204574,117.61837906370296,,0,0,0,117.61837906370296
21,ALA,8.143290504279054,,0,0,0,8.143290504279054,4.469241221156621,,0,0,0,4.469241221156621,177.66726669911202,,0,0,0,177.66726669911202,52.08486595667111,,0,0,0,52.08486595667111,18.247311461144413,,0,0,0,18.247311461144413,122.9483277602786,,0,0,0,122.9483277602786
22,ARG,8.388346222660672,,0,0,0,8.388346222660672,4.093961634712509,,0,0,0,4.093961634712509,176.41737533288378,,0,0,0,176.41737533288378,57.73347033333333,,0,0,0,57.73347033333333,30.1913518509213,,0,0,0,30.1913518509213,121.15115238412699,,0,0,0,121.15115238412699
23,ASP,8.396997477894327,,0,0,0,8.396997477894327,4.6897727610889115,,0,0,0,4.6897727610889115,177.1930790877012,,0,0,0,177.1930790877012,54.808883440120994,,0,0,0,54.808883440120994,41.13904105319126,,0,0,0,41.13904105319126,118.53562540298036,,0,0,0,118.53562540298036
24,SER,8.237382675452325,,0,0,0,8.237382675452325,4.430752344272394,,0,0,0,4.430752344272394,175.2687996956821,,0,0,0,175.2687996956821,59.00386499156399,,0,0,0,59.00386499156399,63.941737197041846,,0,0,0,63.941737197041846,114.4232422944167,,0,0,0,114.4232422944167
25,GLY,8.297441562626263,,0,0,0,8.297441562626263,3.8486260040515052,,0,0,0,3.8486260040515052,173.20262555706515,,0,0,0,173.20262555706515,45.66059141023976,,0,0,0,45.66059141023976,,,0,0,0,,110.2702494567155,,0,0,0,110.2702494567155
26,TRP,7.855933444988345,,0,0,0,7.855933444988345,4.738215312415363,,0,0,0,4.738215312415363,175.51373853357754,,0,0,0,175.51373853357754,56.37087350153735,,0,0,0,56.37087350153735,30.661746979759133,,0,0,0,30.661746979759133,120.06558849346209,,0,0,0,120.06558849346209
27,ALA,9.078241321522922,,0,0,0,9.078241321522922,4.679789775058276,,0,0,0,4.679789775058276,175.82465018992676,,0,0,0,175.82465018992676,50.54416182783883,,0,0,0,50.54416182783883,21.225450311094463,,0,0,0,21.225450311094463,126.68727298268954,,0,0,0,126.68727298268954
28,GLU,9.168781653280053,,0,0,0,9.168781653280053,4.402975257958707,,0,0,0,4.402975257958707,177.64336104821845,,0,0,0,177.64336104821845,57.740563246353645,,0,0,0,57.740563246353645,30.02129261133866,,0,0,0,30.02129261133866,124.78857010874681,,0,0,0,124.78857010874681
29,LEU,9.576058147369297,,0,0,0,9.576058147369297,4.12448393073038,,0,0,0,4.12448393073038,178.27545007906537,,0,0,0,178.27545007906537,58.38905083803419,,0,0,0,58.38905083803419,42.249890356709955,,0,0,0,42.249890356709955,128.0944280809857,,0,0,0,128.0944280809857
30,SER,8.734756784965036,,0,0,0,8.734756784965036,4.189941008352758,,0,0,0,4.189941008352758,176.7670933587801,,0,0,0,176.7670933587801,61.70258743725164,,0,0,0,61.70258743725164,62.39625881731602,,0,0,0,62.39625881731602,113.82114935016651,,0,0,0,113.82114935016651
31,ALA,7.842543700693751,,0,0,0,7.842543700693751,4.144972564685315,,0,0,0,4.144972564685315,180.25913284319572,,0,0,0,180.25913284319572,54.77965442998113,,0,0,0,54.77965442998113,18.44292754993895,,0,0,0,18.44292754993895,124.98241684870129,,0,0,0,124.98241684870129
32,VAL,8.909778558108558,,0,0,0,8.909778558108558,3.5296331111610613,,0,0,0,3.5296331111610613,178.20162475716506,,0,0,0,178.20162475716506,66.93773015641025,,0,0,0,66.93773015641025,31.61394387990898,,0,0,0,31.61394387990898,120.45241425395716,,0,0,0,120.45241425395716
33,GLY,9.136934244200244,,0,0,0,9.136934244200244,3.787894434204685,,0,0,0,3.787894434204685,176.15449951872571,,0,0,0,176.15449951872571,47.54796291409701,,0,0,0,47.54796291409701,,,0,0,0,,108.54878387604617,,0,0,0,108.54878387604617
34,SER,8.295705271739372,,0,0,0,8.295705271739372,4.288805703041403,,0,0,0,4.288805703041403,176.5246057199578,,0,0,0,176.5246057199578,61.65199657893772,,0,0,0,61.65199657893772,63.32206703884449,,0,0,0,63.32206703884449,117.3991617502331,,0,0,0,117.3991617502331
35,TYR,8.072743875818626,,0,0,0,8.072743875818626,4.117157887742812,,0,0,0,4.117157887742812,178.09678382699522,,0,0,0,178.09678382699522,61.99147805946831,,0,0,0,61.99147805946831,38.979337383782884,,0,0,0,38.979337383782884,124.2299402019203,,0,0,0,124.2299402019203
36,LEU,8.775601491519591,,0,0,0,8.775601491519591,3.691883724930625,,0,0,0,3.691883724930625,178.94822774099234,,0,0,0,178.94822774099234,57.47503641154956,,0,0,0,57.47503641154956,40.24250846738261,,0,0,0,40.24250846738261,120.74211998775114,,0,0,0,120.74211998775114
37,ALA,8.39593722960928,,0,0,0,8.39593722960928,4.466615206565657,,0,0,0,4.466615206565657,179.29953929311245,,0,0,0,179.29953929311245,54.653979101393055,,0,0,0,54.653979101393055,18.507781694333445,,0,0,0,18.507781694333445,120.40566416819291,,0,0,0,120.40566416819291
38,LYS,7.453839008136307,,0,0,0,7.453839008136307,4.060852443556444,,0,0,0,4.060852443556444,177.97245105332445,,0,0,0,177.97245105332445,58.1090942964702,,0,0,0,58.1090942964702,32.947170943068045,,0,0,0,32.947170943068045,116.15695236063937,,0,0,0,116.15695236063937
39,ASN,7.694423397768897,,0,0,0,7.694423397768897,4.5718393375235875,,0,0,0,4.5718393375235875,175.3490263590243,,0,0,0,175.3490263590243,54.24830393519259,,0,0,0,54.24830393519259,40.13807921986902,,0,0,0,40.13807921986902,115.0182995427628,,0,0,0,115.0182995427628
40,ASP,8.068845816749917,,0,0,0,8.068845816749917,5.04307817967033,,0,0,0,5.04307817967033,174.82915317666223,,0,0,0,174.82915317666223,51.50253328908314,,0,0,0,51.50253328908314,41.65404616393051,,0,0,0,41.65404616393051,120.7288188341603,,0,0,0,120.7288188341603
41,PRO,,,0,0,0,,4.519111747852148,,0,0,0,4.519111747852148,177.43328828497613,,0,0,0,177.43328828497613,64.54384935611056,,0,0,0,64.54384935611056,32.113239607348206,,0,0,0,32.113239607348206,,,0,0,0,
42,SER,8.233327416866468,,0,0,0,8.233327416866468,4.405614287107337,,0,0,0,4.405614287107337,174.82617774582084,,0,0,0,174.82617774582084,58.823144516189366,,0,0,0,58.823144516189366,63.060801216389166,,0,0,0,63.060801216389166,112.63186679134199,,0,0,0,112.63186679134199
43,PHE,7.940873325086026,,0,0,0,7.940873325086026,4.435149202541902,,0,0,0,4.435149202541902,174.24366562054058,,0,0,0,174.24366562054058,57.81366002917638,,0,0,0,57.81366002917638,38.55345073009213,,0,0,0,38.55345073009213,125.37671863159063,,0,0,0,125.37671863159063
44,ASP,7.948099146220446,,0,0,0,7.948099146220446,4.9387657964923966,,0,0,0,4.9387657964923966,175.26344011728827,,0,0,0,175.26344011728827,50.88187956784327,,0,0,0,50.88187956784327,42.289705667771116,,0,0,0,42.289705667771116,127.99560849755245,,0,0,0,127.99560849755245
45,PRO,,,0,0,0,,4.20466483548396,,0,0,0,4.20466483548396,178.20644585252526,,0,0,0,178.20644585252526,64.96442077716728,,0,0,0,64.96442077716728,32.68029022709513,,0,0,0,32.68029022709513,,,0,0,0,
46,ARG,8.109012077899878,,0,0,0,8.109012077899878,4.072585932831058,,0,0,0,4.072585932831058,177.43725436583972,,0,0,0,177.43725436583972,58.41898718753468,,0,0,0,58.41898718753468,29.96986071147186,,0,0,0,29.96986071147186,117.95268148346098,,0,0,0,117.95268148346098
47,ASN,7.946575740698191,,0,0,0,7.946575740698191,4.458325267288267,,0,0,0,4.458325267288267,176.34336917161727,,0,0,0,176.34336917161727,54.79014077454767,,0,0,0,54.79014077454767,38.41148803223443,,0,0,0,38.41148803223443,117.4927467979132,,0,0,0,117.4927467979132
48,TRP,7.856173065162615,,0,0,0,7.856173065162615,4.526107713991564,,0,0,0,4.526107713991564,177.7233249153846,,0,0,0,177.7233249153846,59.113069282761685,,0,0,0,59.113069282761685,30.19741120860806,,0,0,0,30.19741120860806,119.5693542998224,,0,0,0,119.5693542998224
49,GLY,8.435484983227884,,0,0,0,8.435484983227884,4.084706098973249,,0,0,0,4.084706098973249,175.58179888741813,,0,0,0,175.58179888741813,46.2368060999112,,0,0,0,46.2368060999112,,,0,0,0,,108.1961626119436,,0,0,0,108.1961626119436
50,HIS,8.707114093795093,,0,0,0,8.707114093795093,4.252496528210679,,0,0,0,4.252496528210679,177.0077969625541,,0,0,0,177.0077969625541,59.54091489115329,,0,0,0,59.54091489115329,29.5434797970918,,0,0,0,29.5434797970918,119.95147956581197,,0,0,0,119.95147956581197
51,GLY,8.670021906743257,,0,0,0,8.670021906743257,3.963792150571651,,0,0,0,3.963792150571651,175.97334482732268,,0,0,0,175.97334482732268,46.61071117753913,,0,0,0,46.61071117753913,,,0,0,0,,107.74991562197246,,0,0,0,107.74991562197246
52,ARG,7.9146714613331115,,0,0,0,7.9146714613331115,4.240043162670663,,0,0,0,4.240043162670663,178.7737479142635,,0,0,0,178.7737479142635,58.262006651998,,0,0,0,58.262006651998,30.45950613046953,,0,0,0,30.45950613046953,121.2776957570818,,0,0,0,121.2776957570818
53,LEU,8.513406468259518,,0,0,0,8.513406468259518,4.14259946989677,,0,0,0,4.14259946989677,178.49008524029304,,0,0,0,178.49008524029304,58.02566077935953,,0,0,0,58.02566077935953,41.894156805783105,,0,0,0,41.894156805783105,122.32288339019868,,0,0,0,122.32288339019868
54,SER,8.590066152630703,,0,0,0,8.590066152630703,4.095983705677655,,0,0,0,4.095983705677655,176.78575509859584,,0,0,0,176.78575509859584,62.02172346901432,,0,0,0,62.02172346901432,62.33951813261738,,0,0,0,62.33951813261738,114.7581750002664,,0,0,0,114.7581750002664
55,GLN,7.786471560478411,,0,0,0,7.786471560478411,4.0617217360639355,,0,0,0,4.0617217360639355,178.19144594797424,,0,0,0,178.19144594797424,58.601599936957484,,0,0,0,58.601599936957484,28.45848103185148,,0,0,0,28.45848103185148,121.3506901005772,,0,0,0,121.3506901005772
56,MET,8.188535505094904,,0,0,0,8.188535505094904,4.11408267025752,,0,0,0,4.11408267025752,178.7758605524531,,0,0,0,178.7758605524531,59.158500126418026,,0,0,0,59.158500126418026,33.20503988986569,,0,0,0,33.20503988986569,119.34624185516705,,0,0,0,119.34624185516705
57,VAL,8.310497277994227,,0,0,0,8.310497277994227,3.4829193199911197,,0,0,0,3.4829193199911197,177.88285570184817,,0,0,0,177.88285570184817,65.37995574636474,,0,0,0,65.37995574636474,31.025560315046064,,0,0,0,31.025560315046064,116.18617089340104,,0,0,0,116.18617089340104
58,LYS,8.141734678088577,,0,0,0,8.141734678088577,4.023526343265068,,0,0,0,4.023526343265068,177.48513244333444,,0,0,0,177.48513244333444,58.45767366934177,,0,0,0,58.45767366934177,32.46951856905872,,0,0,0,32.46951856905872,119.87412356678323,,0,0,0,119.87412356678323
59,LYS,7.546101726973026,,0,0,0,7.546101726973026,4.264607893900544,,0,0,0,4.264607893900544,176.77851676830392,,0,0,0,176.77851676830392,55.84090287869908,,0,0,0,55.84090287869908,32.626193074814076,,0,0,0,32.626193074814076,116.4061946447386,,0,0,0,116.4061946447386
60,LEU,7.338006470446221,,0,0,0,7.338006470446221,4.195642993711844,,0,0,0,4.195642993711844,177.6547795615329,,0,0,0,177.6547795615329,54.14447028235098,,0,0,0,54.14447028235098,41.21754242885448,,0,0,0,41.21754242885448,121.9239886044511,,0,0,0,121.9239886044511
61,ASP,8.738344115589966,,0,0,0,8.738344115589966,4.254630497369297,,0,0,0,4.254630497369297,176.04960782692308,,0,0,0,176.04960782692308,56.630020487662335,,0,0,0,56.630020487662335,40.32876225626596,,0,0,0,40.32876225626596,123.57291617032968,,0,0,0,123.57291617032968
62,PHE,7.172074316217118,,0,0,0,7.172074316217118,4.48947118013653,,0,0,0,4.48947118013653,174.56682819203576,,0,0,0,174.56682819203576,57.27676137784438,,0,0,0,57.27676137784438,38.81034937845488,,0,0,0,38.81034937845488,112.7692370086913,,0,0,0,112.7692370086913
63,LEU,7.635561312909313,,0,0,0,7.635561312909313,4.849119339760241,,0,0,0,4.849119339760241,175.7154488075036,,0,0,0,175.7154488075036,53.49861365788656,,0,0,0,53.49861365788656,44.68257677906538,,0,0,0,44.68257677906538,121.33123689027639,,0,0,0,121.33123689027639
64,THR,9.015995644472195,,0,0,0,9.015995644472195,4.627307787329338,,0,0,0,4.627307787329338,173.78957377080695,,0,0,0,173.78957377080695,61.84621327021867,,0,0,0,61.84621327021867,70.32863885888001,,0,0,0,70.32863885888001,118.28094461131646,,0,0,0,118.28094461131646
65,VAL,8.730667631818182,,0,0,0,8.730667631818182,5.086086672344322,,0,0,0,5.086086672344322,175.48587738830614,,0,0,0,175.48587738830614,60.9866544484238,,0,0,0,60.9866544484238,33.42385964967255,,0,0,0,33.42385964967255,126.55736901259296,,0,0,0,126.55736901259296
66,GLN,8.874006771250972,,0,0,0,8.874006771250972,4.561205839238539,,0,0,0,4.561205839238539,174.00885469138083,,0,0,0,174.00885469138083,54.012649451909205,,0,0,0,54.012649451909205,30.591462425907423,,0,0,0,30.591462425907423,126.35246432868243,,0,0,0,126.35246432868243
67,GLU,8.600835448568098,,0,0,0,8.600835448568098,5.0628273001998,,0,0,0,5.0628273001998,175.96130871499057,,0,0,0,175.96130871499057,55.64202341827062,,0,0,0,55.64202341827062,30.91251669038184,,0,0,0,30.91251669038184,122.99955558477079,,0,0,0,122.99955558477079
68,SER,9.004115255250307,,0,0,0,9.004115255250307,4.641664456876457,,0,0,0,4.641664456876457,172.48631735635476,,0,0,0,172.48631735635476,57.33022525524475,,0,0,0,57.33022525524475,65.32704493079143,,0,0,0,65.32704493079143,120.1001888995893,,0,0,0,120.1001888995893
69,ARG,8.662686446814298,,0,0,0,8.662686446814298,4.924640571461871,,0,0,0,4.924640571461871,175.65223412457544,,0,0,0,175.65223412457544,55.52891768473194,,0,0,0,55.52891768473194,31.318359556865357,,0,0,0,31.318359556865357,124.7815586,,0,0,0,124.7815586
70,ASN,8.641298501609501,,0,0,0,8.641298501609501,4.724802021162172,,0,0,0,4.724802021162172,175.10505851560106,,0,0,0,175.10505851560106,52.07163231842047,,0,0,0,52.07163231842047,38.774931312276614,,0,0,0,38.774931312276614,125.92134086465757,,0,0,0,125.92134086465757
71,GLY,8.760940092507493,,0,0,0,8.760940092507493,3.9264722356893116,,0,0,0,3.9264722356893116,174.75031212743923,,0,0,0,174.75031212743923,47.01397445868576,,0,0,0,47.01397445868576,,,0,0,0,,115.79005353280608,,0,0,0,115.79005353280608
72,SER,8.752759526806527,,0,0,0,8.752759526806527,4.481369637046287,,0,0,0,4.481369637046287,173.77831981735486,,0,0,0,173.77831981735486,58.32111536576201,,0,0,0,58.32111536576201,63.74678524366744,,0,0,0,63.74678524366744,121.2750248416195,,0,0,0,121.2750248416195
73,LYS,7.813596857098456,,0,0,0,7.813596857098456,4.61992743030303,,0,0,0,4.61992743030303,175.11163193419912,,0,0,0,175.11163193419912,55.10631015619381,,0,0,0,55.10631015619381,34.939561162598515,,0,0,0,34.939561162598515,123.20847731486846,,0,0,0,123.20847731486846
74,LEU,8.658655408047508,,0,0,0,8.658655408047508,4.708535698029748,,0,0,0,4.708535698029748,176.72232538321677,,0,0,0,176.72232538321677,54.71356486372516,,0,0,0,54.71356486372516,43.18490668046953,,0,0,0,43.18490668046953,124.28305601832612,,0,0,0,124.28305601832612
75,HIS,9.117911287051836,,0,0,0,9.117911287051836,4.779458463952714,,0,0,0,4.779458463952714,174.2099511325175,,0,0,0,174.2099511325175,54.84156949458875,,0,0,0,54.84156949458875,32.48313795993451,,0,0,0,32.48313795993451,121.23717589698636,,0,0,0,121.23717589698636
76,SER,8.97476530825286,,0,0,0,8.97476530825286,5.209130721212121,,0,0,0,5.209130721212121,173.87691422624596,,0,0,0,173.87691422624596,57.68464967228327,,0,0,0,57.68464967228327,64.75925343624154,,0,0,0,64.75925343624154,117.696002647669,,0,0,0,117.696002647669
77,GLU,9.001795134959485,,0,0,0,9.001795134959485,5.420496015151515,,0,0,0,5.420496015151515,175.4702912554168,,0,0,0,175.4702912554168,55.01755852921523,,0,0,0,55.01755852921523,33.20485146798202,,0,0,0,33.20485146798202,123.43465708366078,,0,0,0,123.43465708366078
78,ILE,9.334873990997892,,0,0,0,9.334873990997892,5.735451956554557,,0,0,0,5.735451956554557,174.44653121576758,,0,0,0,174.44653121576758,58.312607769180815,,0,0,0,58.312607769180815,42.04352612172272,,0,0,0,42.04352612172272,116.66422871635032,,0,0,0,116.66422871635032
79,ARG,8.983984687179486,,0,0,0,8.983984687179486,4.662837368120768,,0,0,0,4.662837368120768,174.5674388573482,,0,0,0,174.5674388573482,54.412555751531805,,0,0,0,54.412555751531805,33.385745116994116,,0,0,0,33.385745116994116,122.41850389353425,,0,0,0,122.41850389353425
80,LEU,8.6653670000555,,0,0,0,8.6653670000555,4.550176836235987,,0,0,0,4.550176836235987,177.39596563304474,,0,0,0,177.39596563304474,55.95600348472084,,0,0,0,55.95600348472084,42.06204358567543,,0,0,0,42.06204358567543,125.72251702459208,,0,0,0,125.72251702459208
81,ARG,8.792709903490953,,0,0,0,8.792709903490953,4.340073855899655,,0,0,0,4.340073855899655,176.4334845981241,,0,0,0,176.4334845981241,56.48135818639138,,0,0,0,56.48135818639138,30.75156767041847,,0,0,0,30.75156767041847,125.31704151323676,,0,0,0,125.31704151323676
82,HIS,8.53212217072927,,0,0,0,8.53212217072927,4.5493623448495955,,0,0,0,4.5493623448495955,175.0357507512765,,0,0,0,175.0357507512765,55.918350137728936,,0,0,0,55.918350137728936,30.290024386413588,,0,0,0,30.290024386413588,119.4870346906871,,0,0,0,119.4870346906871
83,ASP,8.124652579509378,,0,0,0,8.124652579509378,4.628624974780775,,0,0,0,4.628624974780775,176.0811516447497,,0,0,0,176.0811516447497,54.29807359316794,,0,0,0,54.29807359316794,40.798705583233435,,0,0,0,40.798705583233435,122.25670061733823,,0,0,0,122.25670061733823
84,GLY,8.313647743795094,,0,0,0,8.313647743795094,3.9133409932928185,,0,0,0,3.9133409932928185,174.00651141885336,,0,0,0,174.00651141885336,44.87216785896326,,0,0,0,44.87216785896326,,,0,0,0,,111.19955902721168,,0,0,0,111.19955902721168
85,LEU,8.14146186947497,,0,0,0,8.14146186947497,4.0697825581751585,,0,0,0,4.0697825581751585,176.7010614553946,,0,0,0,176.7010614553946,54.83854148601954,,0,0,0,54.83854148601954,42.30359098765123,,0,0,0,42.30359098765123,123.79783173131312,,0,0,0,123.79783173131312
86,GLU,8.505655984010433,,0,0,0,8.505655984010433,4.21722370054945,,0,0,0,4.21722370054945,176.66564802037962,,0,0,0,176.66564802037962,56.35750201472972,,0,0,0,56.35750201472972,29.572460132467533,,0,0,0,29.572460132467533,124.84985737989788,,0,0,0,124.84985737989788
87,HIS,8.427868220374071,,0,0,0,8.427868220374071,4.340433983860584,,0,0,0,4.340433983860584,175.2647573091908,,0,0,0,175.2647573091908,56.24094937148407,,0,0,0,56.24094937148407,28.683399078327227,,0,0,0,28.683399078327227,122.13505146503496,,0,0,0,122.13505146503496
88,HIS,8.396803468115218,,0,0,0,8.396803468115218,4.419393485259185,,0,0,0,4.419393485259185,174.84610890810856,,0,0,0,174.84610890810856,55.945868204329,,0,0,0,55.945868204329,28.54552662939283,,0,0,0,28.54552662939283,120.57011431394716,,0,0,0,120.57011431394716
89,HIS,8.374177511499612,,0,0,0,8.374177511499612,4.394313683843934,,0,0,0,4.394313683843934,174.80831926593407,,0,0,0,174.80831926593407,56.438022262487515,,0,0,0,56.438022262487515,28.693859992585192,,0,0,0,28.693859992585192,121.12619661835387,,0,0,0,121.12619661835387