RESNUM,RESNAME,H_X,H_Y,H_BEST_REF_SCORE,H_BEST_REF_COV,H_BEST_REF_MATCH,H_UCBShift,HA_X,HA_Y,HA_BEST_REF_SCORE,HA_BEST_REF_COV,HA_BEST_REF_MATCH,HA_UCBShift,C_X,C_Y,C_BEST_REF_SCORE,C_BEST_REF_COV,C_BEST_REF_MATCH,C_UCBShift,CA_X,CA_Y,CA_BEST_REF_SCORE,CA_BEST_REF_COV,CA_BEST_REF_MATCH,CA_UCBShift,CB_X,CB_Y,CB_BEST_REF_SCORE,CB_BEST_REF_COV,CB_BEST_REF_MATCH,CB_UCBShift,N_X,N_Y,N_BEST_REF_SCORE,N_BEST_REF_COV,N_BEST_REF_MATCH,N_UCBShift
1,MET,8.391703005167054,,0,0,0,8.391703005167054,4.390963002020202,,0,0,0,4.390963002020202,175.39776514788545,,0,0,0,175.39776514788545,55.29071931334221,,0,0,0,55.29071931334221,32.77138539000444,,0,0,0,32.77138539000444,121.12544724317904,,0,0,0,121.12544724317904
2,GLY,8.389195255683205,,0,0,0,8.389195255683205,3.9514272951270955,,0,0,0,3.9514272951270955,174.0130001475691,,0,0,0,174.0130001475691,45.51948310758686,,0,0,0,45.51948310758686,,,0,0,0,,111.61982254192473,,0,0,0,111.61982254192473
3,HIS,8.466610727705628,,0,0,0,8.466610727705628,4.347697391186591,,0,0,0,4.347697391186591,174.43571786128317,,0,0,0,174.43571786128317,55.77610153916639,,0,0,0,55.77610153916639,28.969625685581086,,0,0,0,28.969625685581086,119.08054142759462,,0,0,0,119.08054142759462
4,HIS,8.59525057996448,,0,0,0,8.59525057996448,4.410668182822732,,0,0,0,4.410668182822732,175.1703829984016,,0,0,0,175.1703829984016,56.119508226623374,,0,0,0,56.119508226623374,28.820153506859807,,0,0,0,28.820153506859807,120.1339439415529,,0,0,0,120.1339439415529
5,HIS,8.443016533616383,,0,0,0,8.443016533616383,4.399023278071929,,0,0,0,4.399023278071929,175.2029901158175,,0,0,0,175.2029901158175,56.20370144134754,,0,0,0,56.20370144134754,28.7590379490454,,0,0,0,28.7590379490454,121.48533650809746,,0,0,0,121.48533650809746
6,HIS,8.464162327211676,,0,0,0,8.464162327211676,4.352014319008769,,0,0,0,4.352014319008769,174.6662048533633,,0,0,0,174.6662048533633,56.46129314645355,,0,0,0,56.46129314645355,28.735442512870463,,0,0,0,28.735442512870463,121.59917818256743,,0,0,0,121.59917818256743
7,HIS,8.465815335098235,,0,0,0,8.465815335098235,4.315262221117772,,0,0,0,4.315262221117772,174.57748713110223,,0,0,0,174.57748713110223,56.37439485455101,,0,0,0,56.37439485455101,28.791778797369297,,0,0,0,28.791778797369297,121.6402145954046,,0,0,0,121.6402145954046
8,HIS,8.369267138128539,,0,0,0,8.369267138128539,4.231036052264402,,0,0,0,4.231036052264402,174.33664231798755,,0,0,0,174.33664231798755,56.40104526750472,,0,0,0,56.40104526750472,28.75352912016872,,0,0,0,28.75352912016872,122.62637456490177,,0,0,0,122.62637456490177
9,SER,8.147307597363747,,0,0,0,8.147307597363747,4.362953180924631,,0,0,0,4.362953180924631,174.11488617384282,,0,0,0,174.11488617384282,58.2284835986902,,0,0,0,58.2284835986902,63.33443238742368,,0,0,0,63.33443238742368,119.11059706772672,,0,0,0,119.11059706772672
10,HIS,8.408718982556332,,0,0,0,8.408718982556332,4.418816009967809,,0,0,0,4.418816009967809,174.49422213396048,,0,0,0,174.49422213396048,56.17676829151404,,0,0,0,56.17676829151404,29.237437081934733,,0,0,0,29.237437081934733,121.64817104139195,,0,0,0,121.64817104139195
11,MET,8.15404119022089,,0,0,0,8.15404119022089,4.089985586699411,,0,0,0,4.089985586699411,174.8991507943945,,0,0,0,174.8991507943945,55.78575848251193,,0,0,0,55.78575848251193,32.99742083479853,,0,0,0,32.99742083479853,122.90247257797202,,0,0,0,122.90247257797202
12,LEU,8.35543458983239,,0,0,0,8.35543458983239,4.772805468892219,,0,0,0,4.772805468892219,177.91964152541902,,0,0,0,177.91964152541902,53.14461986653347,,0,0,0,53.14461986653347,43.76893895815851,,0,0,0,43.76893895815851,123.75534652856588,,0,0,0,123.75534652856588
13,THR,8.69907891968587,,0,0,0,8.69907891968587,4.410969078354978,,0,0,0,4.410969078354978,177.11031446439117,,0,0,0,177.11031446439117,61.36607102192252,,0,0,0,61.36607102192252,70.40228722223887,,0,0,0,70.40228722223887,113.77447478382173,,0,0,0,113.77447478382173
14,LYS,8.814695976534574,,0,0,0,8.814695976534574,4.061450794866245,,0,0,0,4.061450794866245,176.95483377045176,,0,0,0,176.95483377045176,58.500067941280946,,0,0,0,58.500067941280946,31.97421377829393,,0,0,0,31.97421377829393,120.73736145436786,,0,0,0,120.73736145436786
15,HIS,7.9064053113719615,,0,0,0,7.9064053113719615,4.6980105865301365,,0,0,0,4.6980105865301365,175.1127111496559,,0,0,0,175.1127111496559,55.531153662698415,,0,0,0,55.531153662698415,30.505612933150182,,0,0,0,30.505612933150182,117.34657892069598,,0,0,0,117.34657892069598
16,GLY,8.189127956748807,,0,0,0,8.189127956748807,3.9604289773615267,,0,0,0,3.9604289773615267,173.86797617264958,,0,0,0,173.86797617264958,45.759895934154734,,0,0,0,45.759895934154734,,,0,0,0,,108.9648408984904,,0,0,0,108.9648408984904
17,LYS,7.770444383066932,,0,0,0,7.770444383066932,4.445563771911422,,0,0,0,4.445563771911422,175.96649348328893,,0,0,0,175.96649348328893,54.78903676494617,,0,0,0,54.78903676494617,34.44465783283938,,0,0,0,34.44465783283938,119.16749513860584,,0,0,0,119.16749513860584
18,ASN,8.77292603965479,,0,0,0,8.77292603965479,4.913266474347874,,0,0,0,4.913266474347874,175.07936071027305,,0,0,0,175.07936071027305,51.38828034650904,,0,0,0,51.38828034650904,39.62172454537685,,0,0,0,39.62172454537685,120.80697424192475,,0,0,0,120.80697424192475
19,PRO,,,0,0,0,,4.224280627461428,,0,0,0,4.224280627461428,178.06452642656234,,0,0,0,178.06452642656234,65.28102574352869,,0,0,0,65.28102574352869,32.5989055012432,,0,0,0,32.5989055012432,,,0,0,0,
20,VAL,8.276510939527139,,0,0,0,8.276510939527139,3.719596561319236,,0,0,0,3.719596561319236,178.03165239000444,,0,0,0,178.03165239000444,66.20755791994672,,0,0,0,66.20755791994672,31.584895628982128,,0,0,0,31.584895628982128,119.10905039171385,,0,0,0,119.10905039171385
21,MET,7.995057494660894,,0,0,0,7.995057494660894,4.287819086907537,,0,0,0,4.287819086907537,178.67757429499946,,0,0,0,178.67757429499946,57.65821241853702,,0,0,0,57.65821241853702,31.8143448993007,,0,0,0,31.8143448993007,117.86728122387056,,0,0,0,117.86728122387056
22,GLU,8.266592446669996,,0,0,0,8.266592446669996,3.9810238944111447,,0,0,0,3.9810238944111447,178.58241347324898,,0,0,0,178.58241347324898,59.47782983701298,,0,0,0,59.47782983701298,30.02239807153957,,0,0,0,30.02239807153957,120.62020531364192,,0,0,0,120.62020531364192
23,LEU,8.675614857581307,,0,0,0,8.675614857581307,3.887860218195693,,0,0,0,3.887860218195693,178.57882861812632,,0,0,0,178.57882861812632,58.05461056762127,,0,0,0,58.05461056762127,41.69165991766012,,0,0,0,41.69165991766012,120.01400614452214,,0,0,0,120.01400614452214
24,ASN,8.26859024036519,,0,0,0,8.26859024036519,4.602577344522145,,0,0,0,4.602577344522145,177.59735825561106,,0,0,0,177.59735825561106,55.879502923226774,,0,0,0,55.879502923226774,37.991869580053276,,0,0,0,37.991869580053276,119.58798855541126,,0,0,0,119.58798855541126
25,GLU,8.146027654256853,,0,0,0,8.146027654256853,4.040993547466423,,0,0,0,4.040993547466423,178.18092313858364,,0,0,0,178.18092313858364,58.77432896013431,,0,0,0,58.77432896013431,29.53737910130425,,0,0,0,29.53737910130425,118.0919772857143,,0,0,0,118.0919772857143
26,LYS,7.479622516799866,,0,0,0,7.479622516799866,4.0209222620768115,,0,0,0,4.0209222620768115,176.50028824401153,,0,0,0,176.50028824401153,57.25502918543123,,0,0,0,57.25502918543123,33.58241877609058,,0,0,0,33.58241877609058,116.84057876981907,,0,0,0,116.84057876981907
27,ARG,8.003687824469974,,0,0,0,8.003687824469974,4.577460629043179,,0,0,0,4.577460629043179,175.8757443359141,,0,0,0,175.8757443359141,55.18836382772783,,0,0,0,55.18836382772783,32.456199265540015,,0,0,0,32.456199265540015,119.64056531543457,,0,0,0,119.64056531543457
28,ARG,8.336060556554557,,0,0,0,8.336060556554557,4.506282511227661,,0,0,0,4.506282511227661,177.23625784270732,,0,0,0,177.23625784270732,56.13945734558774,,0,0,0,56.13945734558774,31.26678233950494,,0,0,0,31.26678233950494,120.42087796147742,,0,0,0,120.42087796147742
29,GLY,8.65925492059052,,0,0,0,8.65925492059052,3.9734068103840605,,0,0,0,3.9734068103840605,175.02207573391053,,0,0,0,175.02207573391053,45.86091844422245,,0,0,0,45.86091844422245,,,0,0,0,,111.12171036435787,,0,0,0,111.12171036435787
30,LEU,7.563595418081918,,0,0,0,7.563595418081918,4.26880112455045,,0,0,0,4.26880112455045,176.21123822267177,,0,0,0,176.21123822267177,54.99135195543346,,0,0,0,54.99135195543346,42.46259988055278,,0,0,0,42.46259988055278,120.15962667469752,,0,0,0,120.15962667469752
31,LYS,8.435979916783216,,0,0,0,8.435979916783216,4.534713624259075,,0,0,0,4.534713624259075,175.14887739394493,,0,0,0,175.14887739394493,55.31869262234987,,0,0,0,55.31869262234987,34.042076922072376,,0,0,0,34.042076922072376,122.5970839945166,,0,0,0,122.5970839945166
32,TYR,8.71141226184371,,0,0,0,8.71141226184371,5.280757054995005,,0,0,0,5.280757054995005,176.1708779370685,,0,0,0,176.1708779370685,56.96106625530025,,0,0,0,56.96106625530025,40.5681508483683,,0,0,0,40.5681508483683,124.89889643487068,,0,0,0,124.89889643487068
33,GLU,9.179691888805639,,0,0,0,9.179691888805639,4.773738811793762,,0,0,0,4.773738811793762,175.0077361190365,,0,0,0,175.0077361190365,54.43276206554002,,0,0,0,54.43276206554002,33.16340178103008,,0,0,0,33.16340178103008,123.09415751213785,,0,0,0,123.09415751213785
34,LEU,8.876208268109668,,0,0,0,8.876208268109668,4.673828540187591,,0,0,0,4.673828540187591,176.73566934236874,,0,0,0,176.73566934236874,55.289363343672996,,0,0,0,55.289363343672996,41.85681625833611,,0,0,0,41.85681625833611,126.92867627722278,,0,0,0,126.92867627722278
35,ILE,8.888051176823177,,0,0,0,8.888051176823177,4.1596795466810965,,0,0,0,4.1596795466810965,176.5738221851482,,0,0,0,176.5738221851482,61.461206790026644,,0,0,0,61.461206790026644,37.86258114784105,,0,0,0,37.86258114784105,127.51111150628262,,0,0,0,127.51111150628262
36,SER,8.000673943645245,,0,0,0,8.000673943645245,4.625251853885004,,0,0,0,4.625251853885004,172.56486688303917,,0,0,0,172.56486688303917,57.80487278778998,,0,0,0,57.80487278778998,64.42368146075036,,0,0,0,64.42368146075036,113.53771683215119,,0,0,0,113.53771683215119
37,GLU,8.66794085975136,,0,0,0,8.66794085975136,5.065124553074702,,0,0,0,5.065124553074702,174.93911938658562,,0,0,0,174.93911938658562,55.23426741373626,,0,0,0,55.23426741373626,32.06919773571983,,0,0,0,32.06919773571983,124.47518578798979,,0,0,0,124.47518578798979
38,THR,8.882328907409258,,0,0,0,8.882328907409258,4.634251858313908,,0,0,0,4.634251858313908,173.83972344917305,,0,0,0,173.83972344917305,60.29370865624375,,0,0,0,60.29370865624375,71.4348493136419,,0,0,0,71.4348493136419,118.90233484527694,,0,0,0,118.90233484527694
39,GLY,8.54946439119214,,0,0,0,8.54946439119214,4.020807259859585,,0,0,0,4.020807259859585,174.37174746335887,,0,0,0,174.37174746335887,44.747552433671885,,0,0,0,44.747552433671885,,,0,0,0,,109.78164991597292,,0,0,0,109.78164991597292
40,GLY,8.317778708885559,,0,0,0,8.317778708885559,4.05176433497891,,0,0,0,4.05176433497891,175.04917097813853,,0,0,0,175.04917097813853,44.79912967771673,,0,0,0,44.79912967771673,,,0,0,0,,108.1276918448274,,0,0,0,108.1276918448274
41,SER,8.456183420357421,,0,0,0,8.456183420357421,4.221443974314574,,0,0,0,4.221443974314574,175.3789158574037,,0,0,0,175.3789158574037,59.92830179392274,,0,0,0,59.92830179392274,62.99810752526918,,0,0,0,62.99810752526918,115.30771758383284,,0,0,0,115.30771758383284
42,HIS,7.697447852020201,,0,0,0,7.697447852020201,4.667635265112665,,0,0,0,4.667635265112665,174.76019061214896,,0,0,0,174.76019061214896,56.21887825712066,,0,0,0,56.21887825712066,29.450620381707182,,0,0,0,29.450620381707182,118.08058098277833,,0,0,0,118.08058098277833
43,ASP,7.931242467138417,,0,0,0,7.931242467138417,4.7869104688145185,,0,0,0,4.7869104688145185,176.2519737928627,,0,0,0,176.2519737928627,53.93678103762349,,0,0,0,53.93678103762349,41.52637117160617,,0,0,0,41.52637117160617,120.48201094231325,,0,0,0,120.48201094231325
44,LYS,8.061078492191141,,0,0,0,8.061078492191141,4.428809574758575,,0,0,0,4.428809574758575,175.65139216237097,,0,0,0,175.65139216237097,56.94949271040626,,0,0,0,56.94949271040626,33.2934565964258,,0,0,0,33.2934565964258,119.77547329051505,,0,0,0,119.77547329051505
45,ARG,8.614612621628373,,0,0,0,8.614612621628373,5.277188835392385,,0,0,0,5.277188835392385,174.41375181857032,,0,0,0,174.41375181857032,54.473911493123545,,0,0,0,54.473911493123545,33.07446578840049,,0,0,0,33.07446578840049,123.57641608614719,,0,0,0,123.57641608614719
46,PHE,9.548119202031302,,0,0,0,9.548119202031302,5.276329845454545,,0,0,0,5.276329845454545,174.81440239359532,,0,0,0,174.81440239359532,56.056512903613054,,0,0,0,56.056512903613054,41.87770135903541,,0,0,0,41.87770135903541,124.81550551336441,,0,0,0,124.81550551336441
47,VAL,9.204343782994783,,0,0,0,9.204343782994783,4.991983838034188,,0,0,0,4.991983838034188,175.44494935962928,,0,0,0,175.44494935962928,60.9842033017538,,0,0,0,60.9842033017538,33.15312015147075,,0,0,0,33.15312015147075,122.85640413982684,,0,0,0,122.85640413982684
48,MET,9.308456622505272,,0,0,0,9.308456622505272,5.396298438417138,,0,0,0,5.396298438417138,174.3267524648296,,0,0,0,174.3267524648296,53.00751334561549,,0,0,0,53.00751334561549,34.96137689646464,,0,0,0,34.96137689646464,125.73274659313464,,0,0,0,125.73274659313464
49,GLU,9.320986142463092,,0,0,0,9.320986142463092,5.575556862914863,,0,0,0,5.575556862914863,175.65707087044066,,0,0,0,175.65707087044066,54.023122924825174,,0,0,0,54.023122924825174,33.4301184456599,,0,0,0,33.4301184456599,122.40388118621934,,0,0,0,122.40388118621934
50,VAL,9.338794394194695,,0,0,0,9.338794394194695,4.90378339040959,,0,0,0,4.90378339040959,173.3749057327839,,0,0,0,173.3749057327839,58.402908262370964,,0,0,0,58.402908262370964,35.03653699004329,,0,0,0,35.03653699004329,123.07998165878566,,0,0,0,123.07998165878566
51,GLU,8.2004511999223,,0,0,0,8.2004511999223,5.263670897990898,,0,0,0,5.263670897990898,175.89287178887224,,0,0,0,175.89287178887224,54.84329065875791,,0,0,0,54.84329065875791,31.56660465028305,,0,0,0,31.56660465028305,127.29178531156066,,0,0,0,127.29178531156066
52,VAL,9.088943016267066,,0,0,0,9.088943016267066,4.34946334498002,,0,0,0,4.34946334498002,175.43118914593185,,0,0,0,175.43118914593185,61.50564562225552,,0,0,0,61.50564562225552,34.63794716404706,,0,0,0,34.63794716404706,126.5016029064269,,0,0,0,126.5016029064269
53,ASP,9.448347894105893,,0,0,0,9.448347894105893,4.301583622391497,,0,0,0,4.301583622391497,175.69054877130648,,0,0,0,175.69054877130648,55.4929578953602,,0,0,0,55.4929578953602,40.29068983471529,,0,0,0,40.29068983471529,128.90339023288934,,0,0,0,128.90339023288934
54,GLY,8.589353017488067,,0,0,0,8.589353017488067,3.8588347573842814,,0,0,0,3.8588347573842814,173.89816823764568,,0,0,0,173.89816823764568,45.34030110897436,,0,0,0,45.34030110897436,,,0,0,0,,103.5805536515207,,0,0,0,103.5805536515207
55,GLN,7.8524720439504945,,0,0,0,7.8524720439504945,4.558541437212787,,0,0,0,4.558541437212787,174.30683207135087,,0,0,0,174.30683207135087,54.2580693033522,,0,0,0,54.2580693033522,31.04723965010545,,0,0,0,31.04723965010545,120.84070005131535,,0,0,0,120.84070005131535
56,LYS,8.192081684321234,,0,0,0,8.192081684321234,5.045946470629371,,0,0,0,5.045946470629371,175.56619096715505,,0,0,0,175.56619096715505,55.22789996173827,,0,0,0,55.22789996173827,33.85602402241093,,0,0,0,33.85602402241093,123.05222563633033,,0,0,0,123.05222563633033
57,PHE,9.26167515851371,,0,0,0,9.26167515851371,4.864003335631035,,0,0,0,4.864003335631035,174.5328017130647,,0,0,0,174.5328017130647,56.60407096838717,,0,0,0,56.60407096838717,41.790631962271064,,0,0,0,41.790631962271064,122.58472797032967,,0,0,0,122.58472797032967
58,GLN,8.746261970607172,,0,0,0,8.746261970607172,5.337887483344433,,0,0,0,5.337887483344433,175.21966864416694,,0,0,0,175.21966864416694,54.264233595537796,,0,0,0,54.264233595537796,31.76988581012876,,0,0,0,31.76988581012876,120.86149650198135,,0,0,0,120.86149650198135
59,GLY,9.113580556465756,,0,0,0,9.113580556465756,4.28236306995227,,0,0,0,4.28236306995227,172.2273656901987,,0,0,0,172.2273656901987,45.557484101770456,,0,0,0,45.557484101770456,,,0,0,0,,109.6243543519203,,0,0,0,109.6243543519203
60,ALA,8.428969978882229,,0,0,0,8.428969978882229,5.349387697002997,,0,0,0,5.349387697002997,177.00850271819849,,0,0,0,177.00850271819849,50.50161226090576,,0,0,0,50.50161226090576,21.156582762820513,,0,0,0,21.156582762820513,125.9599422917638,,0,0,0,125.9599422917638
61,GLY,9.08826878078033,,0,0,0,9.08826878078033,4.519877292074592,,0,0,0,4.519877292074592,173.27703971561218,,0,0,0,173.27703971561218,45.42161656935287,,0,0,0,45.42161656935287,,,0,0,0,,108.76661490674326,,0,0,0,108.76661490674326
62,SER,8.814302052336553,,0,0,0,8.814302052336553,4.733505518581418,,0,0,0,4.733505518581418,173.91319508634143,,0,0,0,173.91319508634143,59.90788124859029,,0,0,0,59.90788124859029,63.87691855243645,,0,0,0,63.87691855243645,114.69878040372406,,0,0,0,114.69878040372406
63,ASN,7.553017509390609,,0,0,0,7.553017509390609,4.157467162046288,,0,0,0,4.157467162046288,174.8666172109002,,0,0,0,174.8666172109002,52.27355812656233,,0,0,0,52.27355812656233,40.176031457564655,,0,0,0,40.176031457564655,115.30935588356088,,0,0,0,115.30935588356088
64,LYS,8.443504025474525,,0,0,0,8.443504025474525,3.7197551792624046,,0,0,0,3.7197551792624046,177.84935888383836,,0,0,0,177.84935888383836,60.31847969407814,,0,0,0,60.31847969407814,32.120368799261854,,0,0,0,32.120368799261854,120.36230263298368,,0,0,0,120.36230263298368
65,LYS,7.851829433166833,,0,0,0,7.851829433166833,3.9872066835719835,,0,0,0,3.9872066835719835,178.8454175089799,,0,0,0,178.8454175089799,59.1756708939394,,0,0,0,59.1756708939394,32.3210051015984,,0,0,0,32.3210051015984,119.43114058534799,,0,0,0,119.43114058534799
66,VAL,8.117642683349983,,0,0,0,8.117642683349983,3.585550522335997,,0,0,0,3.585550522335997,178.1210285979243,,0,0,0,178.1210285979243,66.29962533353313,,0,0,0,66.29962533353313,31.792753254273503,,0,0,0,31.792753254273503,120.60180688420469,,0,0,0,120.60180688420469
67,ALA,8.68809797086247,,0,0,0,8.68809797086247,4.210194922424797,,0,0,0,4.210194922424797,179.21210245694863,,0,0,0,179.21210245694863,55.51081602035187,,0,0,0,55.51081602035187,18.4449493971584,,0,0,0,18.4449493971584,122.67478035153735,,0,0,0,122.67478035153735
68,LYS,8.54959709129759,,0,0,0,8.54959709129759,3.9499427492451993,,0,0,0,3.9499427492451993,178.98137154685315,,0,0,0,178.98137154685315,60.54619063683539,,0,0,0,60.54619063683539,32.350331693179044,,0,0,0,32.350331693179044,117.03674726001776,,0,0,0,117.03674726001776
69,ALA,8.270063534171385,,0,0,0,8.270063534171385,4.0115364990953495,,0,0,0,4.0115364990953495,179.49243976102787,,0,0,0,179.49243976102787,55.436750967371516,,0,0,0,55.436750967371516,17.983671897607948,,0,0,0,17.983671897607948,122.79120195455656,,0,0,0,122.79120195455656
70,TYR,8.740783946758796,,0,0,0,8.740783946758796,4.438611893514819,,0,0,0,4.438611893514819,178.5208346749806,,0,0,0,178.5208346749806,61.52699159153069,,0,0,0,61.52699159153069,37.55797260389055,,0,0,0,37.55797260389055,117.67914052954823,,0,0,0,117.67914052954823
71,ALA,8.775400983433233,,0,0,0,8.775400983433233,4.12705801973027,,0,0,0,4.12705801973027,179.28240017644578,,0,0,0,179.28240017644578,55.58931703356088,,0,0,0,55.58931703356088,18.118318065900766,,0,0,0,18.118318065900766,123.0146920054057,,0,0,0,123.0146920054057
72,ALA,8.659894721262072,,0,0,0,8.659894721262072,4.015618017377068,,0,0,0,4.015618017377068,179.08869042026862,,0,0,0,179.08869042026862,55.38275128084693,,0,0,0,55.38275128084693,18.555123451887003,,0,0,0,18.555123451887003,120.79418901253192,,0,0,0,120.79418901253192
73,LEU,8.737444178438228,,0,0,0,8.737444178438228,3.9868407444333447,,0,0,0,3.9868407444333447,178.99411839573204,,0,0,0,178.99411839573204,58.007626069896766,,0,0,0,58.007626069896766,41.57700868961039,,0,0,0,41.57700868961039,121.4969856562826,,0,0,0,121.4969856562826
74,ALA,8.368221918559218,,0,0,0,8.368221918559218,4.082274336901987,,0,0,0,4.082274336901987,179.99255194148074,,0,0,0,179.99255194148074,55.13068388387168,,0,0,0,55.13068388387168,18.06516041975247,,0,0,0,18.06516041975247,120.68800064047619,,0,0,0,120.68800064047619
75,ALA,7.797563292424242,,0,0,0,7.797563292424242,2.5556255994172488,,0,0,0,2.5556255994172488,178.82314835308026,,0,0,0,178.82314835308026,54.57975379742479,,0,0,0,54.57975379742479,18.373556050377402,,0,0,0,18.373556050377402,121.7179256988456,,0,0,0,121.7179256988456
76,LEU,8.453937687035188,,0,0,0,8.453937687035188,4.222116538822289,,0,0,0,4.222116538822289,179.63033758480407,,0,0,0,179.63033758480407,58.0396248525197,,0,0,0,58.0396248525197,41.615114453712955,,0,0,0,41.615114453712955,118.79062352444222,,0,0,0,118.79062352444222
77,GLU,8.415296075213675,,0,0,0,8.415296075213675,4.015728666988568,,0,0,0,4.015728666988568,178.77898066519592,,0,0,0,178.77898066519592,59.40760912225552,,0,0,0,59.40760912225552,29.656737136313687,,0,0,0,29.656737136313687,117.71893648847819,,0,0,0,117.71893648847819
78,LYS,7.755358426007326,,0,0,0,7.755358426007326,4.1661488357031855,,0,0,0,4.1661488357031855,178.41766174447218,,0,0,0,178.41766174447218,58.19987165957931,,0,0,0,58.19987165957931,32.81320563525364,,0,0,0,32.81320563525364,118.74522484991675,,0,0,0,118.74522484991675
79,LEU,8.00182088965479,,0,0,0,8.00182088965479,3.988249697913198,,0,0,0,3.988249697913198,177.4606989402098,,0,0,0,177.4606989402098,56.12468372956488,,0,0,0,56.12468372956488,42.827074457636805,,0,0,0,42.827074457636805,116.43700515781441,,0,0,0,116.43700515781441
80,PHE,7.839691925330227,,0,0,0,7.839691925330227,5.102175664013765,,0,0,0,5.102175664013765,174.31498258682984,,0,0,0,174.31498258682984,54.47703831322011,,0,0,0,54.47703831322011,38.558071773426576,,0,0,0,38.558071773426576,117.51243945871907,,0,0,0,117.51243945871907
81,PRO,,,0,0,0,,4.37876013995449,,0,0,0,4.37876013995449,177.34051137984792,,0,0,0,177.34051137984792,64.63115887515262,,0,0,0,64.63115887515262,31.854547961810415,,0,0,0,31.854547961810415,,,0,0,0,
82,ASP,8.392065756277056,,0,0,0,8.392065756277056,4.656750616167166,,0,0,0,4.656750616167166,176.00052326078367,,0,0,0,176.00052326078367,54.06828467861583,,0,0,0,54.06828467861583,40.53332633251748,,0,0,0,40.53332633251748,118.10036508830059,,0,0,0,118.10036508830059
83,THR,7.777284537556889,,0,0,0,7.777284537556889,4.583571098631924,,0,0,0,4.583571098631924,172.95671506926962,,0,0,0,172.95671506926962,60.62475589747474,,0,0,0,60.62475589747474,69.85341111533467,,0,0,0,69.85341111533467,118.20451230079921,,0,0,0,118.20451230079921
84,PRO,,,0,0,0,,4.515855321667222,,0,0,0,4.515855321667222,176.55905358262294,,0,0,0,176.55905358262294,62.96538751809302,,0,0,0,62.96538751809302,32.327417403013655,,0,0,0,32.327417403013655,,,0,0,0,
85,LEU,8.344652235458986,,0,0,0,8.344652235458986,4.131393848756799,,0,0,0,4.131393848756799,177.35261827899322,,0,0,0,177.35261827899322,54.95272096423022,,0,0,0,54.95272096423022,42.1136321544178,,0,0,0,42.1136321544178,122.80222211367521,,0,0,0,122.80222211367521
86,ALA,8.109444397624598,,0,0,0,8.109444397624598,4.283898586663337,,0,0,0,4.283898586663337,177.16486629759132,,0,0,0,177.16486629759132,52.189060488944385,,0,0,0,52.189060488944385,18.18001505684871,,0,0,0,18.18001505684871,127.68373941566766,,0,0,0,127.68373941566766
87,LEU,8.096938342812743,,0,0,0,8.096938342812743,4.167434806077257,,0,0,0,4.167434806077257,176.90441037207236,,0,0,0,176.90441037207236,55.49674265382951,,0,0,0,55.49674265382951,42.056079437351535,,0,0,0,42.056079437351535,123.53087990653235,,0,0,0,123.53087990653235
88,ASP,8.125322777972027,,0,0,0,8.125322777972027,4.565632075069375,,0,0,0,4.565632075069375,176.3310262808414,,0,0,0,176.3310262808414,54.42170577818293,,0,0,0,54.42170577818293,41.24677466026751,,0,0,0,41.24677466026751,122.70383938373294,,0,0,0,122.70383938373294
89,ALA,8.325225496903098,,0,0,0,8.325225496903098,4.365645355558331,,0,0,0,4.365645355558331,177.2832089889555,,0,0,0,177.2832089889555,52.555085483216786,,0,0,0,52.555085483216786,18.950425720612724,,0,0,0,18.950425720612724,125.56952123567542,,0,0,0,125.56952123567542