RESNUM,RESNAME,H_X,H_Y,H_BEST_REF_SCORE,H_BEST_REF_COV,H_BEST_REF_MATCH,H_UCBShift,HA_X,HA_Y,HA_BEST_REF_SCORE,HA_BEST_REF_COV,HA_BEST_REF_MATCH,HA_UCBShift,C_X,C_Y,C_BEST_REF_SCORE,C_BEST_REF_COV,C_BEST_REF_MATCH,C_UCBShift,CA_X,CA_Y,CA_BEST_REF_SCORE,CA_BEST_REF_COV,CA_BEST_REF_MATCH,CA_UCBShift,CB_X,CB_Y,CB_BEST_REF_SCORE,CB_BEST_REF_COV,CB_BEST_REF_MATCH,CB_UCBShift,N_X,N_Y,N_BEST_REF_SCORE,N_BEST_REF_COV,N_BEST_REF_MATCH,N_UCBShift
1,MET,8.33859441061716,,0,0,0,8.33859441061716,4.290034349478299,,0,0,0,4.290034349478299,175.90609940355202,,0,0,0,175.90609940355202,55.3384227078699,,0,0,0,55.3384227078699,32.894231215201465,,0,0,0,32.894231215201465,121.20854866809302,,0,0,0,121.20854866809302
2,GLY,8.407135157326007,,0,0,0,8.407135157326007,3.952139493537018,,0,0,0,3.952139493537018,174.37529459303474,,0,0,0,174.37529459303474,44.87276364017094,,0,0,0,44.87276364017094,,,0,0,0,,111.79888708435453,,0,0,0,111.79888708435453
3,HIS,8.378712148251749,,0,0,0,8.378712148251749,4.5558712165778665,,0,0,0,4.5558712165778665,174.67468193480408,,0,0,0,174.67468193480408,55.82018199119214,,0,0,0,55.82018199119214,29.823703556032857,,0,0,0,29.823703556032857,119.07516582693418,,0,0,0,119.07516582693418
4,HIS,8.602150319386169,,0,0,0,8.602150319386169,4.423140390259741,,0,0,0,4.423140390259741,175.16276858618048,,0,0,0,175.16276858618048,56.15066168626929,,0,0,0,56.15066168626929,29.78683995991231,,0,0,0,29.78683995991231,121.4052434036963,,0,0,0,121.4052434036963
5,HIS,8.44796960030525,,0,0,0,8.44796960030525,4.373689935786436,,0,0,0,4.373689935786436,174.62123123792873,,0,0,0,174.62123123792873,56.53444209284049,,0,0,0,56.53444209284049,28.72951949986125,,0,0,0,28.72951949986125,122.37776990152626,,0,0,0,122.37776990152626
6,HIS,8.379165227333777,,0,0,0,8.379165227333777,4.334574397202798,,0,0,0,4.334574397202798,174.65402684591518,,0,0,0,174.65402684591518,56.113750264335664,,0,0,0,56.113750264335664,29.039736096797647,,0,0,0,29.039736096797647,122.31935044486625,,0,0,0,122.31935044486625
7,HIS,8.367045180924631,,0,0,0,8.367045180924631,4.375630011815962,,0,0,0,4.375630011815962,174.72304936134975,,0,0,0,174.72304936134975,55.78866776519592,,0,0,0,55.78866776519592,28.471154529526032,,0,0,0,28.471154529526032,122.68575984212454,,0,0,0,122.68575984212454
8,HIS,8.315793286968587,,0,0,0,8.315793286968587,4.353795096842047,,0,0,0,4.353795096842047,174.44594294473305,,0,0,0,174.44594294473305,56.24279429787435,,0,0,0,56.24279429787435,29.186779984382284,,0,0,0,29.186779984382284,121.27396947284383,,0,0,0,121.27396947284383
9,SER,8.324416921933622,,0,0,0,8.324416921933622,4.424068217643468,,0,0,0,4.424068217643468,174.36621640295814,,0,0,0,174.36621640295814,58.310779879387276,,0,0,0,58.310779879387276,63.55041204618159,,0,0,0,63.55041204618159,119.58315066489622,,0,0,0,119.58315066489622
10,HIS,8.472716531113331,,0,0,0,8.472716531113331,4.418259303124653,,0,0,0,4.418259303124653,174.78914544279053,,0,0,0,174.78914544279053,56.74603703744589,,0,0,0,56.74603703744589,29.13221252987568,,0,0,0,29.13221252987568,121.3115826454601,,0,0,0,121.3115826454601
11,MET,8.308849313958262,,0,0,0,8.308849313958262,4.307375412814963,,0,0,0,4.307375412814963,176.20220205474527,,0,0,0,176.20220205474527,55.267987936630036,,0,0,0,55.267987936630036,33.25719430046065,,0,0,0,33.25719430046065,122.6004872537074,,0,0,0,122.6004872537074
12,ASN,8.936970191858142,,0,0,0,8.936970191858142,4.689689734487735,,0,0,0,4.689689734487735,176.03924215592184,,0,0,0,176.03924215592184,53.135968057720056,,0,0,0,53.135968057720056,39.5650463026085,,0,0,0,39.5650463026085,122.28269963959929,,0,0,0,122.28269963959929
13,SER,8.811578047663447,,0,0,0,8.811578047663447,4.104162056549006,,0,0,0,4.104162056549006,176.26693608613053,,0,0,0,176.26693608613053,61.61695825344655,,0,0,0,61.61695825344655,62.715175106715506,,0,0,0,62.715175106715506,117.17001226431901,,0,0,0,117.17001226431901
14,ALA,8.482177771878122,,0,0,0,8.482177771878122,4.0820838963591966,,0,0,0,4.0820838963591966,179.13066270984572,,0,0,0,179.13066270984572,55.72727659837385,,0,0,0,55.72727659837385,18.615418946431348,,0,0,0,18.615418946431348,124.1992510040515,,0,0,0,124.1992510040515
15,GLU,8.297568184781884,,0,0,0,8.297568184781884,3.9327726887445893,,0,0,0,3.9327726887445893,179.13147746749362,,0,0,0,179.13147746749362,59.90753439268509,,0,0,0,59.90753439268509,29.77477729875125,,0,0,0,29.77477729875125,117.86583395929071,,0,0,0,117.86583395929071
16,GLN,8.492244343567544,,0,0,0,8.492244343567544,4.166834348434898,,0,0,0,4.166834348434898,178.76899373706848,,0,0,0,178.76899373706848,58.903219444083696,,0,0,0,58.903219444083696,28.632957753896104,,0,0,0,28.632957753896104,119.02781622264402,,0,0,0,119.02781622264402
17,THR,8.34686233053058,,0,0,0,8.34686233053058,4.096086963056388,,0,0,0,4.096086963056388,176.03585845451215,,0,0,0,176.03585845451215,67.59749227322122,,0,0,0,67.59749227322122,68.14545353231769,,0,0,0,68.14545353231769,118.35215845080475,,0,0,0,118.35215845080475
18,VAL,8.733201606005107,,0,0,0,8.733201606005107,3.637847670917971,,0,0,0,3.637847670917971,177.45970156377513,,0,0,0,177.45970156377513,67.4765175479687,,0,0,0,67.4765175479687,31.626474685919636,,0,0,0,31.626474685919636,122.22000088610278,,0,0,0,122.22000088610278
19,THR,8.285343056426907,,0,0,0,8.285343056426907,3.99722307536075,,0,0,0,3.99722307536075,177.20990093244532,,0,0,0,177.20990093244532,66.98912314063159,,0,0,0,66.98912314063159,68.52587225565546,,0,0,0,68.52587225565546,116.82954163431013,,0,0,0,116.82954163431013
20,TRP,8.261128707697857,,0,0,0,8.261128707697857,4.396372434232434,,0,0,0,4.396372434232434,177.7873473012432,,0,0,0,177.7873473012432,60.59483790276945,,0,0,0,60.59483790276945,29.062002519624823,,0,0,0,29.062002519624823,124.9008609086469,,0,0,0,124.9008609086469
21,LEU,8.690354303524254,,0,0,0,8.690354303524254,3.5319763184454436,,0,0,0,3.5319763184454436,179.26122070617714,,0,0,0,179.26122070617714,57.74650287496392,,0,0,0,57.74650287496392,41.551361585342434,,0,0,0,41.551361585342434,118.76492948126874,,0,0,0,118.76492948126874
22,ILE,8.29458773026973,,0,0,0,8.29458773026973,4.132751285930736,,0,0,0,4.132751285930736,180.70206290591076,,0,0,0,180.70206290591076,64.2152783988456,,0,0,0,64.2152783988456,38.37123326603396,,0,0,0,38.37123326603396,121.76988106302586,,0,0,0,121.76988106302586
23,THR,8.082160853507604,,0,0,0,8.082160853507604,4.163665331829282,,0,0,0,4.163665331829282,176.54351816563434,,0,0,0,176.54351816563434,65.42243268781219,,0,0,0,65.42243268781219,68.99172628830058,,0,0,0,68.99172628830058,117.37465672183372,,0,0,0,117.37465672183372
24,LEU,7.977812367654568,,0,0,0,7.977812367654568,4.263100508047509,,0,0,0,4.263100508047509,176.98807224338992,,0,0,0,176.98807224338992,55.013800313242314,,0,0,0,55.013800313242314,42.481777556732155,,0,0,0,42.481777556732155,119.7595069557165,,0,0,0,119.7595069557165
25,GLY,7.840736235675436,,0,0,0,7.840736235675436,4.005958848476524,,0,0,0,4.005958848476524,175.2401604350705,,0,0,0,175.2401604350705,46.216345034992784,,0,0,0,46.216345034992784,,,0,0,0,,107.38530045845266,,0,0,0,107.38530045845266
26,VAL,7.791005601537351,,0,0,0,7.791005601537351,4.135896079442779,,0,0,0,4.135896079442779,175.38214635505605,,0,0,0,175.38214635505605,62.44506796900322,,0,0,0,62.44506796900322,32.31188678966589,,0,0,0,32.31188678966589,113.86149078270618,,0,0,0,113.86149078270618
27,LEU,7.625261086274836,,0,0,0,7.625261086274836,4.4849167907647915,,0,0,0,4.4849167907647915,176.33985942536907,,0,0,0,176.33985942536907,53.64502596919192,,0,0,0,53.64502596919192,43.85491205209235,,0,0,0,43.85491205209235,122.11540852273282,,0,0,0,122.11540852273282
28,GLU,8.337908753141303,,0,0,0,8.337908753141303,4.2124003048867795,,0,0,0,4.2124003048867795,176.19295082279942,,0,0,0,176.19295082279942,56.64050367918193,,0,0,0,56.64050367918193,30.208453184770782,,0,0,0,30.208453184770782,124.16330425917415,,0,0,0,124.16330425917415
29,SER,8.541577268070817,,0,0,0,8.541577268070817,4.543702133411034,,0,0,0,4.543702133411034,173.20915571036184,,0,0,0,173.20915571036184,56.42898883699633,,0,0,0,56.42898883699633,63.067497160517256,,0,0,0,63.067497160517256,117.8516179022533,,0,0,0,117.8516179022533
30,PRO,,,0,0,0,,4.469432527849928,,0,0,0,4.469432527849928,177.12098564517706,,0,0,0,177.12098564517706,62.8327963027306,,0,0,0,62.8327963027306,32.05773625653791,,0,0,0,32.05773625653791,,,0,0,0,
31,LYS,8.45184834104229,,0,0,0,8.45184834104229,4.288870796675547,,0,0,0,4.288870796675547,176.6331737043734,,0,0,0,176.6331737043734,57.30251737753913,,0,0,0,57.30251737753913,32.77628228010323,,0,0,0,32.77628228010323,121.19680587357642,,0,0,0,121.19680587357642
32,LYS,7.953705467465866,,0,0,0,7.953705467465866,4.389384674370074,,0,0,0,4.389384674370074,175.93373170799754,,0,0,0,175.93373170799754,55.55471990553336,,0,0,0,55.55471990553336,33.572219592551896,,0,0,0,33.572219592551896,118.25804948736264,,0,0,0,118.25804948736264
33,THR,8.154232998418248,,0,0,0,8.154232998418248,4.14896026055611,,0,0,0,4.14896026055611,174.77818522865468,,0,0,0,174.77818522865468,62.59518013971029,,0,0,0,62.59518013971029,69.69928601204906,,0,0,0,69.69928601204906,116.28851444241315,,0,0,0,116.28851444241315
34,ILE,8.229922848179598,,0,0,0,8.229922848179598,3.9758746000721503,,0,0,0,3.9758746000721503,176.18713994532135,,0,0,0,176.18713994532135,60.88343505989566,,0,0,0,60.88343505989566,38.60509926535131,,0,0,0,38.60509926535131,126.63201328778445,,0,0,0,126.63201328778445
35,SER,8.34494773937729,,0,0,0,8.34494773937729,4.441138196853147,,0,0,0,4.441138196853147,174.56007142686758,,0,0,0,174.56007142686758,59.09394101756021,,0,0,0,59.09394101756021,63.63149610755355,,0,0,0,63.63149610755355,121.22600802464757,,0,0,0,121.22600802464757
36,ASP,7.988902648174048,,0,0,0,7.988902648174048,4.943577108263959,,0,0,0,4.943577108263959,174.73641586807636,,0,0,0,174.73641586807636,51.45290413812854,,0,0,0,51.45290413812854,41.44570768936619,,0,0,0,41.44570768936619,120.60485857529693,,0,0,0,120.60485857529693
37,PRO,,,0,0,0,,4.301761808391609,,0,0,0,4.301761808391609,178.16119367677322,,0,0,0,178.16119367677322,65.01200778182928,,0,0,0,65.01200778182928,32.49339568632479,,0,0,0,32.49339568632479,,,0,0,0,
38,GLU,8.456856064208013,,0,0,0,8.456856064208013,3.979264826351426,,0,0,0,3.979264826351426,178.05373620351315,,0,0,0,178.05373620351315,60.0510462454268,,0,0,0,60.0510462454268,29.120951906432456,,0,0,0,29.120951906432456,119.31203355179821,,0,0,0,119.31203355179821
39,GLY,8.155228456110557,,0,0,0,8.155228456110557,3.673792497674548,,0,0,0,3.673792497674548,176.10441277635698,,0,0,0,176.10441277635698,46.93283561971917,,0,0,0,46.93283561971917,,,0,0,0,,108.48454364666445,,0,0,0,108.48454364666445
40,PHE,8.242873006193808,,0,0,0,8.242873006193808,4.183016836946386,,0,0,0,4.183016836946386,177.96300739812412,,0,0,0,177.96300739812412,61.72235355740926,,0,0,0,61.72235355740926,39.074130593878344,,0,0,0,39.074130593878344,123.77430448072482,,0,0,0,123.77430448072482
41,LEU,8.69026872984793,,0,0,0,8.69026872984793,3.7123454355339103,,0,0,0,3.7123454355339103,178.76777038401042,,0,0,0,178.76777038401042,57.897068286469086,,0,0,0,57.897068286469086,42.1540946488012,,0,0,0,42.1540946488012,121.04590847908757,,0,0,0,121.04590847908757
42,GLN,8.47625078139638,,0,0,0,8.47625078139638,3.820166301887002,,0,0,0,3.820166301887002,177.67275698248974,,0,0,0,177.67275698248974,59.45630511633367,,0,0,0,59.45630511633367,28.446681366705516,,0,0,0,28.446681366705516,119.64397282806083,,0,0,0,119.64397282806083
43,ALA,7.9903278515595515,,0,0,0,7.9903278515595515,4.044392016255967,,0,0,0,4.044392016255967,179.96749746305917,,0,0,0,179.96749746305917,54.63687341075036,,0,0,0,54.63687341075036,18.052080022771676,,0,0,0,18.052080022771676,120.09937331531802,,0,0,0,120.09937331531802
44,SER,7.969845895288046,,0,0,0,7.969845895288046,4.203816415523366,,0,0,0,4.203816415523366,176.3354764941281,,0,0,0,176.3354764941281,60.8003646035076,,0,0,0,60.8003646035076,63.129564238977686,,0,0,0,63.129564238977686,112.438071946337,,0,0,0,112.438071946337
45,LEU,8.144867932900434,,0,0,0,8.144867932900434,4.253034579267955,,0,0,0,4.253034579267955,178.43009811797646,,0,0,0,178.43009811797646,55.675916092907094,,0,0,0,55.675916092907094,42.411367873559776,,0,0,0,42.411367873559776,119.0376886539738,,0,0,0,119.0376886539738
46,LYS,7.770184084343434,,0,0,0,7.770184084343434,3.879160384143634,,0,0,0,3.879160384143634,177.28806684269063,,0,0,0,177.28806684269063,59.23488135661561,,0,0,0,59.23488135661561,32.223772405278055,,0,0,0,32.223772405278055,120.80799566161616,,0,0,0,120.80799566161616
47,ASP,8.07987952138972,,0,0,0,8.07987952138972,4.671220037706738,,0,0,0,4.671220037706738,177.13998843514264,,0,0,0,177.13998843514264,53.7208339550949,,0,0,0,53.7208339550949,40.3757165520091,,0,0,0,40.3757165520091,113.63644918104119,,0,0,0,113.63644918104119
48,GLY,8.39006852998113,,0,0,0,8.39006852998113,3.9971422469835725,,0,0,0,3.9971422469835725,175.05171670511155,,0,0,0,175.05171670511155,46.495802162432014,,0,0,0,46.495802162432014,,,0,0,0,,108.13458950472861,,0,0,0,108.13458950472861
49,VAL,8.759646529925629,,0,0,0,8.759646529925629,3.6448502141386383,,0,0,0,3.6448502141386383,177.278636880575,,0,0,0,177.278636880575,66.35485943772895,,0,0,0,66.35485943772895,31.677888455599955,,0,0,0,31.677888455599955,122.44260883149629,,0,0,0,122.44260883149629
50,VAL,7.772909838716838,,0,0,0,7.772909838716838,3.604176878879454,,0,0,0,3.604176878879454,178.32270014351207,,0,0,0,178.32270014351207,66.3322335012099,,0,0,0,66.3322335012099,31.43503609958375,,0,0,0,31.43503609958375,119.90388132302698,,0,0,0,119.90388132302698
51,LEU,7.4525798665612175,,0,0,0,7.4525798665612175,3.6838837873903874,,0,0,0,3.6838837873903874,179.04907244252968,,0,0,0,179.04907244252968,57.35805485626041,,0,0,0,57.35805485626041,41.04438483776779,,0,0,0,41.04438483776779,119.99456628106338,,0,0,0,119.99456628106338
52,CYS,8.833502012287713,,0,0,0,8.833502012287713,4.137109148251748,,0,0,0,4.137109148251748,176.7215183523088,,0,0,0,176.7215183523088,64.42292506452992,,0,0,0,64.42292506452992,26.691693775030526,,0,0,0,26.691693775030526,117.32478664037073,,0,0,0,117.32478664037073
53,ARG,8.232024321417471,,0,0,0,8.232024321417471,3.927786633810634,,0,0,0,3.927786633810634,178.67744958469865,,0,0,0,178.67744958469865,59.83968682703963,,0,0,0,59.83968682703963,30.113600644610944,,0,0,0,30.113600644610944,120.34708544573759,,0,0,0,120.34708544573759
54,LEU,8.389385677333777,,0,0,0,8.389385677333777,3.9572047833749586,,0,0,0,3.9572047833749586,178.35672531473526,,0,0,0,178.35672531473526,58.44245636202131,,0,0,0,58.44245636202131,41.70069317627927,,0,0,0,41.70069317627927,121.96740980589965,,0,0,0,121.96740980589965
55,LEU,8.521935237451437,,0,0,0,8.521935237451437,4.087538208186258,,0,0,0,4.087538208186258,178.80846397882118,,0,0,0,178.80846397882118,57.486815466638916,,0,0,0,57.486815466638916,41.050961537862136,,0,0,0,41.050961537862136,120.53441132868242,,0,0,0,120.53441132868242
56,GLU,8.803447006782106,,0,0,0,8.803447006782106,4.042420948742923,,0,0,0,4.042420948742923,179.01705979830723,,0,0,0,179.01705979830723,59.09950582278277,,0,0,0,59.09950582278277,29.12418787203352,,0,0,0,29.12418787203352,120.12706347791654,,0,0,0,120.12706347791654
57,ARG,7.951885135936286,,0,0,0,7.951885135936286,4.164080260014985,,0,0,0,4.164080260014985,178.29183440268068,,0,0,0,178.29183440268068,58.267176823482075,,0,0,0,58.267176823482075,30.087398774070373,,0,0,0,30.087398774070373,118.20848088413808,,0,0,0,118.20848088413808
58,LEU,7.991931643561994,,0,0,0,7.991931643561994,4.300464223581974,,0,0,0,4.300464223581974,177.29013370957375,,0,0,0,177.29013370957375,56.710918190404044,,0,0,0,56.710918190404044,43.715836542285494,,0,0,0,43.715836542285494,118.38293945018869,,0,0,0,118.38293945018869
59,LEU,8.178050087296038,,0,0,0,8.178050087296038,4.815182521195471,,0,0,0,4.815182521195471,175.30517393062493,,0,0,0,175.30517393062493,52.19766268459873,,0,0,0,52.19766268459873,42.406978272710624,,0,0,0,42.406978272710624,119.08333604346764,,0,0,0,119.08333604346764
60,PRO,,,0,0,0,,4.475777318592519,,0,0,0,4.475777318592519,178.34499196233213,,0,0,0,178.34499196233213,63.32846724275724,,0,0,0,63.32846724275724,31.41263399857365,,0,0,0,31.41263399857365,,,0,0,0,
61,GLY,9.040454781363081,,0,0,0,9.040454781363081,3.971374248082473,,0,0,0,3.971374248082473,175.3514211503108,,0,0,0,175.3514211503108,45.73412327908203,,0,0,0,45.73412327908203,,,0,0,0,,113.57524398981019,,0,0,0,113.57524398981019
62,THR,7.849157834965036,,0,0,0,7.849157834965036,4.337471440939615,,0,0,0,4.337471440939615,174.62727220205903,,0,0,0,174.62727220205903,63.58623128651348,,0,0,0,63.58623128651348,70.43175196961371,,0,0,0,70.43175196961371,114.0986943551282,,0,0,0,114.0986943551282
63,ILE,8.327222910911312,,0,0,0,8.327222910911312,4.111735293564768,,0,0,0,4.111735293564768,175.83400731115552,,0,0,0,175.83400731115552,59.84102681529581,,0,0,0,59.84102681529581,36.79102233094683,,0,0,0,36.79102233094683,121.37105902731159,,0,0,0,121.37105902731159
64,GLU,9.25694786928627,,0,0,0,9.25694786928627,4.232402415251415,,0,0,0,4.232402415251415,176.98830619751914,,0,0,0,176.98830619751914,57.73977685796426,,0,0,0,57.73977685796426,30.57113427364857,,0,0,0,30.57113427364857,126.46550543954379,,0,0,0,126.46550543954379
65,LYS,8.29565176111666,,0,0,0,8.29565176111666,4.422374817188367,,0,0,0,4.422374817188367,175.48311788951602,,0,0,0,175.48311788951602,55.64148237281607,,0,0,0,55.64148237281607,34.46933635538906,,0,0,0,34.46933635538906,119.86017508597514,,0,0,0,119.86017508597514
66,VAL,8.21128637144522,,0,0,0,8.21128637144522,4.369329535292485,,0,0,0,4.369329535292485,175.2958686686092,,0,0,0,175.2958686686092,60.14193392610168,,0,0,0,60.14193392610168,34.45188410877456,,0,0,0,34.45188410877456,122.81818100330226,,0,0,0,122.81818100330226
67,TYR,8.812578939932289,,0,0,0,8.812578939932289,4.847620306876457,,0,0,0,4.847620306876457,175.89533486047287,,0,0,0,175.89533486047287,56.012349210300805,,0,0,0,56.012349210300805,38.63774095698746,,0,0,0,38.63774095698746,126.34726098124098,,0,0,0,126.34726098124098
68,PRO,,,0,0,0,,4.4819174246447995,,0,0,0,4.4819174246447995,176.94217171711068,,0,0,0,176.94217171711068,64.44267094247974,,0,0,0,64.44267094247974,32.24182340452326,,0,0,0,32.24182340452326,,,0,0,0,
69,GLU,8.189946889560439,,0,0,0,8.189946889560439,4.534555232614608,,0,0,0,4.534555232614608,174.27388899553225,,0,0,0,174.27388899553225,53.52523820229216,,0,0,0,53.52523820229216,30.0142461502775,,0,0,0,30.0142461502775,119.47865284769675,,0,0,0,119.47865284769675
70,PRO,,,0,0,0,,4.443037144391719,,0,0,0,4.443037144391719,177.27711038952714,,0,0,0,177.27711038952714,63.04000823314463,,0,0,0,63.04000823314463,32.19740871862027,,0,0,0,32.19740871862027,,,0,0,0,
71,ARG,8.740957760056611,,0,0,0,8.740957760056611,4.442277056204906,,0,0,0,4.442277056204906,176.3397793263903,,0,0,0,176.3397793263903,56.4590969969142,,0,0,0,56.4590969969142,31.266074676867575,,0,0,0,31.266074676867575,122.76036451961372,,0,0,0,122.76036451961372
72,SER,8.291641144350095,,0,0,0,8.291641144350095,4.644806608114108,,0,0,0,4.644806608114108,175.44179423369962,,0,0,0,175.44179423369962,57.413847326212675,,0,0,0,57.413847326212675,65.37132165351315,,0,0,0,65.37132165351315,115.25617027636252,,0,0,0,115.25617027636252
73,GLU,9.022975927644577,,0,0,0,9.022975927644577,3.8523120046869797,,0,0,0,3.8523120046869797,177.87513128432678,,0,0,0,177.87513128432678,59.973729169119764,,0,0,0,59.973729169119764,29.611888725574424,,0,0,0,29.611888725574424,123.81350391893108,,0,0,0,123.81350391893108
74,SER,8.370992002847153,,0,0,0,8.370992002847153,4.139158319910645,,0,0,0,4.139158319910645,176.83690055980685,,0,0,0,176.83690055980685,61.19061194558774,,0,0,0,61.19061194558774,62.447977186330334,,0,0,0,62.447977186330334,113.77723409774114,,0,0,0,113.77723409774114
75,GLU,7.786180541125541,,0,0,0,7.786180541125541,3.6296266196497946,,0,0,0,3.6296266196497946,178.55286958402152,,0,0,0,178.55286958402152,58.804439683871685,,0,0,0,58.804439683871685,29.483125189604838,,0,0,0,29.483125189604838,123.2069425973471,,0,0,0,123.2069425973471
76,CYS,8.071844447258298,,0,0,0,8.071844447258298,4.402653780849706,,0,0,0,4.402653780849706,177.18779145798644,,0,0,0,177.18779145798644,62.763700994366744,,0,0,0,62.763700994366744,26.837355913908315,,0,0,0,26.837355913908315,118.90362792556333,,0,0,0,118.90362792556333
77,LEU,8.754591303113553,,0,0,0,8.754591303113553,3.9103798043623046,,0,0,0,3.9103798043623046,178.8811561491231,,0,0,0,178.8811561491231,57.80417834101454,,0,0,0,57.80417834101454,41.54599255057165,,0,0,0,41.54599255057165,119.78052221432456,,0,0,0,119.78052221432456
78,SER,8.116435126612277,,0,0,0,8.116435126612277,4.261504153793428,,0,0,0,4.261504153793428,177.02216010366854,,0,0,0,177.02216010366854,61.78036887080697,,0,0,0,61.78036887080697,62.8886307042291,,0,0,0,62.8886307042291,116.4138792946609,,0,0,0,116.4138792946609
79,ASN,8.491819290287491,,0,0,0,8.491819290287491,4.470546805056055,,0,0,0,4.470546805056055,177.520485813875,,0,0,0,177.520485813875,55.97140774282384,,0,0,0,55.97140774282384,38.034609344538794,,0,0,0,38.034609344538794,121.16845959754134,,0,0,0,121.16845959754134
80,ILE,8.483401808391609,,0,0,0,8.483401808391609,3.6126761777139533,,0,0,0,3.6126761777139533,177.67395199282385,,0,0,0,177.67395199282385,66.29028905439006,,0,0,0,66.29028905439006,38.407855352331,,0,0,0,38.407855352331,120.37709864756356,,0,0,0,120.37709864756356
81,ARG,8.35002133066378,,0,0,0,8.35002133066378,3.8068080933233435,,0,0,0,3.8068080933233435,179.12790000034965,,0,0,0,179.12790000034965,60.01481079552669,,0,0,0,60.01481079552669,30.12286568089688,,0,0,0,30.12286568089688,119.02671128800644,,0,0,0,119.02671128800644
82,GLU,8.329098964008214,,0,0,0,8.329098964008214,4.132734637900988,,0,0,0,4.132734637900988,178.47442936421356,,0,0,0,178.47442936421356,58.90830936459096,,0,0,0,58.90830936459096,28.927105761754913,,0,0,0,28.927105761754913,120.90354339890665,,0,0,0,120.90354339890665
83,PHE,8.420828441958042,,0,0,0,8.420828441958042,4.016515620621045,,0,0,0,4.016515620621045,176.73324526789324,,0,0,0,176.73324526789324,61.687752726007325,,0,0,0,61.687752726007325,39.302952441630595,,0,0,0,39.302952441630595,119.92235254717504,,0,0,0,119.92235254717504
84,LEU,8.64908160970141,,0,0,0,8.64908160970141,3.5333250651487402,,0,0,0,3.5333250651487402,178.69529086755466,,0,0,0,178.69529086755466,57.59971576124986,,0,0,0,57.59971576124986,41.36741253654679,,0,0,0,41.36741253654679,119.43607220181485,,0,0,0,119.43607220181485
85,ARG,8.36278232859918,,0,0,0,8.36278232859918,3.926420002361527,,0,0,0,3.926420002361527,178.99289204265736,,0,0,0,178.99289204265736,59.33159642891553,,0,0,0,59.33159642891553,29.857410504667552,,0,0,0,29.857410504667552,120.31087393964368,,0,0,0,120.31087393964368
86,GLY,8.35966998936064,,0,0,0,8.35966998936064,3.775018525357976,,0,0,0,3.775018525357976,176.09610947431457,,0,0,0,176.09610947431457,47.19401537422578,,0,0,0,47.19401537422578,,,0,0,0,,108.05225348485958,,0,0,0,108.05225348485958
87,CYS,8.809843106893107,,0,0,0,8.809843106893107,3.84218888528971,,0,0,0,3.84218888528971,177.10208336050616,,0,0,0,177.10208336050616,64.01392566747697,,0,0,0,64.01392566747697,26.870105198340546,,0,0,0,26.870105198340546,119.9798617540848,,0,0,0,119.9798617540848
88,GLY,8.305077691364191,,0,0,0,8.305077691364191,3.85756821027306,,0,0,0,3.85756821027306,176.0864477139749,,0,0,0,176.0864477139749,46.982846535447884,,0,0,0,46.982846535447884,,,0,0,0,,108.19758651230991,,0,0,0,108.19758651230991
89,ALA,7.898212400271951,,0,0,0,7.898212400271951,4.167627654123654,,0,0,0,4.167627654123654,179.05309081509603,,0,0,0,179.05309081509603,54.287024158241756,,0,0,0,54.287024158241756,18.77730171872017,,0,0,0,18.77730171872017,123.982861997114,,0,0,0,123.982861997114