RESNUM,RESNAME,H_X,H_Y,H_BEST_REF_SCORE,H_BEST_REF_COV,H_BEST_REF_MATCH,H_UCBShift,HA_X,HA_Y,HA_BEST_REF_SCORE,HA_BEST_REF_COV,HA_BEST_REF_MATCH,HA_UCBShift,C_X,C_Y,C_BEST_REF_SCORE,C_BEST_REF_COV,C_BEST_REF_MATCH,C_UCBShift,CA_X,CA_Y,CA_BEST_REF_SCORE,CA_BEST_REF_COV,CA_BEST_REF_MATCH,CA_UCBShift,CB_X,CB_Y,CB_BEST_REF_SCORE,CB_BEST_REF_COV,CB_BEST_REF_MATCH,CB_UCBShift,N_X,N_Y,N_BEST_REF_SCORE,N_BEST_REF_COV,N_BEST_REF_MATCH,N_UCBShift
1,MET,8.366820648795649,,0,0,0,8.366820648795649,4.419936636527361,,0,0,0,4.419936636527361,175.44874261867577,,0,0,0,175.44874261867577,55.27315763134643,,0,0,0,55.27315763134643,33.122556404245756,,0,0,0,33.122556404245756,121.09327519221334,,0,0,0,121.09327519221334
2,GLY,8.326221462115662,,0,0,0,8.326221462115662,3.9186703780081036,,0,0,0,3.9186703780081036,174.47749202820512,,0,0,0,174.47749202820512,44.96742125621601,,0,0,0,44.96742125621601,,,0,0,0,,110.6058373563159,,0,0,0,110.6058373563159
3,HIS,8.548453618897769,,0,0,0,8.548453618897769,4.456106078399379,,0,0,0,4.456106078399379,174.52824974237984,,0,0,0,174.52824974237984,56.17860850149295,,0,0,0,56.17860850149295,29.358160807004108,,0,0,0,29.358160807004108,119.89243674489956,,0,0,0,119.89243674489956
4,HIS,8.52946497066822,,0,0,0,8.52946497066822,4.433381522188922,,0,0,0,4.433381522188922,174.8416783086802,,0,0,0,174.8416783086802,55.74995572107892,,0,0,0,55.74995572107892,28.918638176018426,,0,0,0,28.918638176018426,121.39644442957598,,0,0,0,121.39644442957598
5,HIS,8.44705583993229,,0,0,0,8.44705583993229,4.373306952425353,,0,0,0,4.373306952425353,174.5576143622211,,0,0,0,174.5576143622211,56.06072258110223,,0,0,0,56.06072258110223,28.725832803757353,,0,0,0,28.725832803757353,121.7234103097014,,0,0,0,121.7234103097014
6,HIS,8.431079272311022,,0,0,0,8.431079272311022,4.388657861122212,,0,0,0,4.388657861122212,174.54213921577866,,0,0,0,174.54213921577866,56.120580459357306,,0,0,0,56.120580459357306,28.765503926401376,,0,0,0,28.765503926401376,122.31787496590077,,0,0,0,122.31787496590077
7,HIS,8.347854643217893,,0,0,0,8.347854643217893,4.3866279841769344,,0,0,0,4.3866279841769344,174.51725009143632,,0,0,0,174.51725009143632,55.8366601548063,,0,0,0,55.8366601548063,28.869173577200577,,0,0,0,28.869173577200577,123.16766712553003,,0,0,0,123.16766712553003
8,HIS,8.346958133644133,,0,0,0,8.346958133644133,4.33212101056721,,0,0,0,4.33212101056721,174.63321395922966,,0,0,0,174.63321395922966,55.75477278848374,,0,0,0,55.75477278848374,28.592023191591743,,0,0,0,28.592023191591743,122.57023035377401,,0,0,0,122.57023035377401
9,SER,8.232327797646798,,0,0,0,8.232327797646798,4.403080136963037,,0,0,0,4.403080136963037,174.652543621867,,0,0,0,174.652543621867,57.70995288616938,,0,0,0,57.70995288616938,61.903856344538795,,0,0,0,61.903856344538795,117.4522173433067,,0,0,0,117.4522173433067
10,HIS,8.138534851637251,,0,0,0,8.138534851637251,4.319317244100344,,0,0,0,4.319317244100344,174.90887226133864,,0,0,0,174.90887226133864,56.486526236274834,,0,0,0,56.486526236274834,27.96610570729271,,0,0,0,27.96610570729271,122.17123003537574,,0,0,0,122.17123003537574
11,SER,8.119790594860696,,0,0,0,8.119790594860696,4.331743518797869,,0,0,0,4.331743518797869,174.6198241503663,,0,0,0,174.6198241503663,59.73592999132534,,0,0,0,59.73592999132534,63.355943576562325,,0,0,0,63.355943576562325,112.87631339680875,,0,0,0,112.87631339680875
12,ASP,8.267561287673438,,0,0,0,8.267561287673438,4.592525660647685,,0,0,0,4.592525660647685,176.2834473596903,,0,0,0,176.2834473596903,54.19031339962815,,0,0,0,54.19031339962815,40.60895055918526,,0,0,0,40.60895055918526,119.27156007296593,,0,0,0,119.27156007296593
13,ASN,7.437177892130093,,0,0,0,7.437177892130093,4.815335388689089,,0,0,0,4.815335388689089,174.80398130749805,,0,0,0,174.80398130749805,52.86029602102342,,0,0,0,52.86029602102342,38.320169645726494,,0,0,0,38.320169645726494,119.27696297569652,,0,0,0,119.27696297569652
14,ASN,8.439973731418581,,0,0,0,8.439973731418581,4.9224694796703305,,0,0,0,4.9224694796703305,173.83710874908422,,0,0,0,173.83710874908422,53.3208815986125,,0,0,0,53.3208815986125,38.7769916512876,,0,0,0,38.7769916512876,121.81281201238207,,0,0,0,121.81281201238207
15,THR,8.813985733355533,,0,0,0,8.813985733355533,5.367327687945387,,0,0,0,5.367327687945387,174.59450953887222,,0,0,0,174.59450953887222,62.37433988256743,,0,0,0,62.37433988256743,70.33943523187924,,0,0,0,70.33943523187924,117.59918271613941,,0,0,0,117.59918271613941
16,ILE,9.256344523243424,,0,0,0,9.256344523243424,5.278972430480631,,0,0,0,5.278972430480631,174.20877158569763,,0,0,0,174.20877158569763,58.72429143568654,,0,0,0,58.72429143568654,40.406223756349206,,0,0,0,40.406223756349206,124.39827650921856,,0,0,0,124.39827650921856
17,PHE,9.3785611488678,,0,0,0,9.3785611488678,5.5306883601121095,,0,0,0,5.5306883601121095,174.06430140997338,,0,0,0,174.06430140997338,55.56081307014652,,0,0,0,55.56081307014652,42.19213466021756,,0,0,0,42.19213466021756,124.54483791963037,,0,0,0,124.54483791963037
18,VAL,8.702423234854034,,0,0,0,8.702423234854034,4.715156294921745,,0,0,0,4.715156294921745,174.3189036116328,,0,0,0,174.3189036116328,60.37026552841048,,0,0,0,60.37026552841048,34.22546533409923,,0,0,0,34.22546533409923,126.65780808740703,,0,0,0,126.65780808740703
19,GLN,8.914717494055944,,0,0,0,8.914717494055944,4.9472393497336,,0,0,0,4.9472393497336,175.4975826559829,,0,0,0,175.4975826559829,53.90763532673438,,0,0,0,53.90763532673438,32.53849488003108,,0,0,0,32.53849488003108,124.71327328014208,,0,0,0,124.71327328014208
20,GLY,8.13000705911866,,0,0,0,8.13000705911866,3.9897655134809633,,0,0,0,3.9897655134809633,175.82430213503164,,0,0,0,175.82430213503164,46.43995836861472,,0,0,0,46.43995836861472,,,0,0,0,,108.85464038162948,,0,0,0,108.85464038162948
21,LEU,8.630260972122322,,0,0,0,8.630260972122322,4.07936981996892,,0,0,0,4.07936981996892,177.34418767476413,,0,0,0,177.34418767476413,56.40727761039516,,0,0,0,56.40727761039516,42.81298305172605,,0,0,0,42.81298305172605,119.60877557284383,,0,0,0,119.60877557284383
22,GLY,8.180688634371185,,0,0,0,8.180688634371185,4.105623357070707,,0,0,0,4.105623357070707,174.8708051582362,,0,0,0,174.8708051582362,44.508915024136975,,0,0,0,44.508915024136975,,,0,0,0,,106.08443343911088,,0,0,0,106.08443343911088
23,GLU,8.821206492440892,,0,0,0,8.821206492440892,4.259944755180929,,0,0,0,4.259944755180929,176.76187838375512,,0,0,0,176.76187838375512,58.23013428365524,,0,0,0,58.23013428365524,29.72501394117549,,0,0,0,29.72501394117549,118.48656300662115,,0,0,0,118.48656300662115
24,ASN,8.345785966955267,,0,0,0,8.345785966955267,4.903887790337441,,0,0,0,4.903887790337441,175.27705321352536,,0,0,0,175.27705321352536,53.11533778695194,,0,0,0,53.11533778695194,38.338283206105004,,0,0,0,38.338283206105004,115.69729210137086,,0,0,0,115.69729210137086
25,VAL,7.376967764030414,,0,0,0,7.376967764030414,4.091041945992896,,0,0,0,4.091041945992896,174.50060147815518,,0,0,0,174.50060147815518,62.3911411989899,,0,0,0,62.3911411989899,32.282010127777774,,0,0,0,32.282010127777774,119.07784451045066,,0,0,0,119.07784451045066
26,THR,7.753094821678322,,0,0,0,7.753094821678322,4.629314011510711,,0,0,0,4.629314011510711,175.3452581826562,,0,0,0,175.3452581826562,60.05265919099234,,0,0,0,60.05265919099234,71.4010835564713,,0,0,0,71.4010835564713,116.31348214552669,,0,0,0,116.31348214552669
27,ILE,8.721064236646686,,0,0,0,8.721064236646686,3.6520777775446787,,0,0,0,3.6520777775446787,177.29271333110222,,0,0,0,177.29271333110222,64.55517673042513,,0,0,0,64.55517673042513,37.024783149239646,,0,0,0,37.024783149239646,122.3710052024864,,0,0,0,122.3710052024864
28,GLU,8.754585530863581,,0,0,0,8.754585530863581,4.080673253785103,,0,0,0,4.080673253785103,178.94519905594962,,0,0,0,178.94519905594962,59.93383927905983,,0,0,0,59.93383927905983,29.12208711969697,,0,0,0,29.12208711969697,119.18884435031634,,0,0,0,119.18884435031634
29,SER,8.13561283931069,,0,0,0,8.13561283931069,4.336111938555888,,0,0,0,4.336111938555888,177.17132063550892,,0,0,0,177.17132063550892,61.633994082106774,,0,0,0,61.633994082106774,63.231420495854145,,0,0,0,63.231420495854145,116.992002592896,,0,0,0,116.992002592896
30,VAL,8.664733155688754,,0,0,0,8.664733155688754,3.5929144774364516,,0,0,0,3.5929144774364516,177.69133957500833,,0,0,0,177.69133957500833,67.03947013702964,,0,0,0,67.03947013702964,31.585486739849042,,0,0,0,31.585486739849042,123.80171713672993,,0,0,0,123.80171713672993
31,ALA,8.702874364130315,,0,0,0,8.702874364130315,3.809739004945055,,0,0,0,3.809739004945055,179.21682010331335,,0,0,0,179.21682010331335,55.719697923598616,,0,0,0,55.719697923598616,18.269341770418475,,0,0,0,18.269341770418475,123.03288374279055,,0,0,0,123.03288374279055
32,ASP,8.403947355289155,,0,0,0,8.403947355289155,4.493335829242979,,0,0,0,4.493335829242979,178.53311389108114,,0,0,0,178.53311389108114,57.14985501197691,,0,0,0,57.14985501197691,40.95061956129426,,0,0,0,40.95061956129426,118.53805658187923,,0,0,0,118.53805658187923
33,TYR,8.069809095315794,,0,0,0,8.069809095315794,4.223249414391165,,0,0,0,4.223249414391165,177.6222736926185,,0,0,0,177.6222736926185,61.27821906895882,,0,0,0,61.27821906895882,38.99905758673548,,0,0,0,38.99905758673548,121.97170093327783,,0,0,0,121.97170093327783
34,PHE,8.984173763675216,,0,0,0,8.984173763675216,4.347639156723831,,0,0,0,4.347639156723831,177.4604613910201,,0,0,0,177.4604613910201,60.88270616036741,,0,0,0,60.88270616036741,38.97020437060717,,0,0,0,38.97020437060717,115.78366782702852,,0,0,0,115.78366782702852
35,LYS,8.449413661388611,,0,0,0,8.449413661388611,4.426167199506049,,0,0,0,4.426167199506049,177.75823938249528,,0,0,0,177.75823938249528,58.25923532584083,,0,0,0,58.25923532584083,32.41142260019425,,0,0,0,32.41142260019425,119.68276780760907,,0,0,0,119.68276780760907
36,GLN,7.722829145343545,,0,0,0,7.722829145343545,4.175194235786436,,0,0,0,4.175194235786436,176.73334561534023,,0,0,0,176.73334561534023,57.55920176551227,,0,0,0,57.55920176551227,28.541720613236762,,0,0,0,28.541720613236762,117.65245421505716,,0,0,0,117.65245421505716
37,ILE,7.86109866978577,,0,0,0,7.86109866978577,3.990001052380953,,0,0,0,3.990001052380953,176.1326323437063,,0,0,0,176.1326323437063,61.57994746889777,,0,0,0,61.57994746889777,38.73430263087468,,0,0,0,38.73430263087468,117.18044492244422,,0,0,0,117.18044492244422
38,GLY,7.899003773576424,,0,0,0,7.899003773576424,4.090426223545899,,0,0,0,4.090426223545899,172.0092822364247,,0,0,0,172.0092822364247,45.25938939123099,,0,0,0,45.25938939123099,,,0,0,0,,106.57057438438783,,0,0,0,106.57057438438783
39,ILE,8.549289752786102,,0,0,0,8.549289752786102,3.9982715412448666,,0,0,0,3.9982715412448666,176.32287457615163,,0,0,0,176.32287457615163,62.00782459028194,,0,0,0,62.00782459028194,38.070978048251746,,0,0,0,38.070978048251746,120.08024078987124,,0,0,0,120.08024078987124
40,ILE,8.287345244666446,,0,0,0,8.287345244666446,3.7387011943334443,,0,0,0,3.7387011943334443,175.80743992188368,,0,0,0,175.80743992188368,61.57097970829171,,0,0,0,61.57097970829171,38.58293785522255,,0,0,0,38.58293785522255,127.07777137113999,,0,0,0,127.07777137113999
41,LYS,8.717605186618936,,0,0,0,8.717605186618936,4.183043692948718,,0,0,0,4.183043692948718,176.18810461919747,,0,0,0,176.18810461919747,56.92836967071262,,0,0,0,56.92836967071262,33.03553516416917,,0,0,0,33.03553516416917,128.54311283432125,,0,0,0,128.54311283432125
42,THR,8.430678604589856,,0,0,0,8.430678604589856,4.658140304595404,,0,0,0,4.658140304595404,174.19276182597957,,0,0,0,174.19276182597957,61.738587076334774,,0,0,0,61.738587076334774,70.3876892033966,,0,0,0,70.3876892033966,121.64849577694527,,0,0,0,121.64849577694527
43,ASN,8.834411532606282,,0,0,0,8.834411532606282,4.6363742981629485,,0,0,0,4.6363742981629485,176.06811519423354,,0,0,0,176.06811519423354,52.96090105728716,,0,0,0,52.96090105728716,38.45779621544011,,0,0,0,38.45779621544011,124.1434628918082,,0,0,0,124.1434628918082
44,LYS,8.61517942249417,,0,0,0,8.61517942249417,4.133945133505383,,0,0,0,4.133945133505383,177.5502632594461,,0,0,0,177.5502632594461,58.31073658170718,,0,0,0,58.31073658170718,32.36914730220335,,0,0,0,32.36914730220335,126.1082688476135,,0,0,0,126.1082688476135
45,LYS,8.147498089121989,,0,0,0,8.147498089121989,4.326311766966366,,0,0,0,4.326311766966366,178.28360097390942,,0,0,0,178.28360097390942,58.13855506817072,,0,0,0,58.13855506817072,32.589500782262185,,0,0,0,32.589500782262185,117.80898205687092,,0,0,0,117.80898205687092
46,THR,7.763023401209901,,0,0,0,7.763023401209901,4.457447735031635,,0,0,0,4.457447735031635,176.2954440488789,,0,0,0,176.2954440488789,61.68442695727605,,0,0,0,61.68442695727605,71.16091658953269,,0,0,0,71.16091658953269,107.07354951037297,,0,0,0,107.07354951037297
47,GLY,8.209864135014985,,0,0,0,8.209864135014985,3.9441410874070373,,0,0,0,3.9441410874070373,173.9509485862804,,0,0,0,173.9509485862804,45.71669322932068,,0,0,0,45.71669322932068,,,0,0,0,,112.02929890960151,,0,0,0,112.02929890960151
48,GLN,7.957900993040292,,0,0,0,7.957900993040292,4.721383440587191,,0,0,0,4.721383440587191,173.65089631942502,,0,0,0,173.65089631942502,53.24573310750916,,0,0,0,53.24573310750916,28.894953903640804,,0,0,0,28.894953903640804,120.57381412451437,,0,0,0,120.57381412451437
49,PRO,,,0,0,0,,4.39891098988789,,0,0,0,4.39891098988789,177.3551749421523,,0,0,0,177.3551749421523,63.208528706709956,,0,0,0,63.208528706709956,31.83094855998446,,0,0,0,31.83094855998446,,,0,0,0,
50,MET,8.650478456571205,,0,0,0,8.650478456571205,4.267249851986902,,0,0,0,4.267249851986902,173.73644331413033,,0,0,0,173.73644331413033,56.13161536201576,,0,0,0,56.13161536201576,31.34401716024531,,0,0,0,31.34401716024531,121.3002991051504,,0,0,0,121.3002991051504
51,ILE,8.041808972344322,,0,0,0,8.041808972344322,4.824657930025531,,0,0,0,4.824657930025531,175.00444013077478,,0,0,0,175.00444013077478,59.66660716030636,,0,0,0,59.66660716030636,40.63865180345765,,0,0,0,40.63865180345765,121.56562675448441,,0,0,0,121.56562675448441
52,ASN,8.752014378216229,,0,0,0,8.752014378216229,4.975571755544456,,0,0,0,4.975571755544456,174.07292660445108,,0,0,0,174.07292660445108,51.74587872366522,,0,0,0,51.74587872366522,40.60366021785437,,0,0,0,40.60366021785437,126.4383913908647,,0,0,0,126.4383913908647
53,LEU,8.83216894014874,,0,0,0,8.83216894014874,4.590468893068043,,0,0,0,4.590468893068043,175.99982107378733,,0,0,0,175.99982107378733,54.42735547164502,,0,0,0,54.42735547164502,43.79232129009879,,0,0,0,43.79232129009879,126.77211885283606,,0,0,0,126.77211885283606
54,TYR,9.252128256227108,,0,0,0,9.252128256227108,4.741123425396825,,0,0,0,4.741123425396825,175.46962052617383,,0,0,0,175.46962052617383,57.30173687796093,,0,0,0,57.30173687796093,39.793471334948386,,0,0,0,39.793471334948386,123.0461555043401,,0,0,0,123.0461555043401
55,THR,8.68851807884338,,0,0,0,8.68851807884338,5.096756326934177,,0,0,0,5.096756326934177,174.53916400040515,,0,0,0,174.53916400040515,60.31465514372849,,0,0,0,60.31465514372849,70.60562091164945,,0,0,0,70.60562091164945,115.83538340929626,,0,0,0,115.83538340929626
56,ASP,8.720969961910312,,0,0,0,8.720969961910312,4.707380772333222,,0,0,0,4.707380772333222,177.13147761881453,,0,0,0,177.13147761881453,53.880451202897106,,0,0,0,53.880451202897106,43.27878778355534,,0,0,0,43.27878778355534,125.02914475962372,,0,0,0,125.02914475962372
57,ARG,8.748117536635586,,0,0,0,8.748117536635586,4.151161983266733,,0,0,0,4.151161983266733,177.24144626558441,,0,0,0,177.24144626558441,58.01907826488512,,0,0,0,58.01907826488512,30.22120773997114,,0,0,0,30.22120773997114,126.11282105738705,,0,0,0,126.11282105738705
58,GLU,8.336641506721056,,0,0,0,8.336641506721056,4.285173979365079,,0,0,0,4.285173979365079,178.1845716002442,,0,0,0,178.1845716002442,58.48994321546232,,0,0,0,58.48994321546232,30.321047771300922,,0,0,0,30.321047771300922,118.47497635484515,,0,0,0,118.47497635484515
59,THR,8.21917072076812,,0,0,0,8.21917072076812,4.412499957650683,,0,0,0,4.412499957650683,176.46527151958597,,0,0,0,176.46527151958597,61.93311686646131,,0,0,0,61.93311686646131,71.02162380564435,,0,0,0,71.02162380564435,107.18250915601067,,0,0,0,107.18250915601067
60,GLY,8.241892861433012,,0,0,0,8.241892861433012,3.947363935414585,,0,0,0,3.947363935414585,173.9588150511322,,0,0,0,173.9588150511322,45.910014255422354,,0,0,0,45.910014255422354,,,0,0,0,,111.55061603847264,,0,0,0,111.55061603847264
61,LYS,8.035438494849593,,0,0,0,8.035438494849593,4.4136031095626596,,0,0,0,4.4136031095626596,175.36733978730157,,0,0,0,175.36733978730157,55.21996242860473,,0,0,0,55.21996242860473,34.21524055799756,,0,0,0,34.21524055799756,120.00964010021646,,0,0,0,120.00964010021646
62,LEU,8.543445702514152,,0,0,0,8.543445702514152,4.46555613048618,,0,0,0,4.46555613048618,176.6118412058053,,0,0,0,176.6118412058053,55.804337376234876,,0,0,0,55.804337376234876,42.13738073792874,,0,0,0,42.13738073792874,121.64984652133421,,0,0,0,121.64984652133421
63,LYS,9.059471441874791,,0,0,0,9.059471441874791,4.319227271339772,,0,0,0,4.319227271339772,176.70208357892108,,0,0,0,176.70208357892108,57.04939442244422,,0,0,0,57.04939442244422,33.11693173820624,,0,0,0,33.11693173820624,121.92323864313465,,0,0,0,121.92323864313465
64,GLY,8.242240006055056,,0,0,0,8.242240006055056,3.9185944693334456,,0,0,0,3.9185944693334456,172.71241769411145,,0,0,0,172.71241769411145,46.257133214885116,,0,0,0,46.257133214885116,,,0,0,0,,108.07617061719391,,0,0,0,108.07617061719391
65,GLU,7.8660318448773445,,0,0,0,7.8660318448773445,5.403253235680986,,0,0,0,5.403253235680986,175.74139767886,,0,0,0,175.74139767886,54.75318406723832,,0,0,0,54.75318406723832,32.946849953191254,,0,0,0,32.946849953191254,120.31158686625042,,0,0,0,120.31158686625042
66,ALA,8.890460965928517,,0,0,0,8.890460965928517,5.6898897591408595,,0,0,0,5.6898897591408595,175.58851450541127,,0,0,0,175.58851450541127,50.83325022096237,,0,0,0,50.83325022096237,23.451613426212674,,0,0,0,23.451613426212674,125.2001741989788,,0,0,0,125.2001741989788
67,THR,9.028387488117438,,0,0,0,9.028387488117438,5.442972111766013,,0,0,0,5.442972111766013,174.47336929843487,,0,0,0,174.47336929843487,60.13253651433566,,0,0,0,60.13253651433566,70.71900807956487,,0,0,0,70.71900807956487,113.39773246632811,,0,0,0,113.39773246632811
68,VAL,9.262247114735263,,0,0,0,9.262247114735263,4.444348417510267,,0,0,0,4.444348417510267,174.31935997712844,,0,0,0,174.31935997712844,60.590424624531025,,0,0,0,60.590424624531025,34.513552275524475,,0,0,0,34.513552275524475,123.84378188764569,,0,0,0,123.84378188764569
69,SER,8.76463259028749,,0,0,0,8.76463259028749,5.087714198956599,,0,0,0,5.087714198956599,174.23178822127872,,0,0,0,174.23178822127872,57.277346456771006,,0,0,0,57.277346456771006,64.08828826695526,,0,0,0,64.08828826695526,123.07150788556999,,0,0,0,123.07150788556999
70,PHE,9.31502281972472,,0,0,0,9.31502281972472,4.67756347065157,,0,0,0,4.67756347065157,176.12789897782218,,0,0,0,176.12789897782218,58.61750516761572,,0,0,0,58.61750516761572,40.682524945809746,,0,0,0,40.682524945809746,124.63652128628038,,0,0,0,124.63652128628038
71,ASP,9.31771319110889,,0,0,0,9.31771319110889,4.462704041142191,,0,0,0,4.462704041142191,175.81354604648686,,0,0,0,175.81354604648686,56.753301902614055,,0,0,0,56.753301902614055,41.65637299744145,,0,0,0,41.65637299744145,121.7548690576701,,0,0,0,121.7548690576701
72,ASP,7.96839002002997,,0,0,0,7.96839002002997,5.089553242374293,,0,0,0,5.089553242374293,175.20867340712064,,0,0,0,175.20867340712064,51.10969261651127,,0,0,0,51.10969261651127,42.49218851543456,,0,0,0,42.49218851543456,117.15134853786213,,0,0,0,117.15134853786213
73,PRO,,,0,0,0,,4.264469513245089,,0,0,0,4.264469513245089,172.32739530648797,,0,0,0,172.32739530648797,67.20505971234321,,0,0,0,67.20505971234321,29.963709714663114,,0,0,0,29.963709714663114,,,0,0,0,
74,PRO,,,0,0,0,,4.328395994166945,,0,0,0,4.328395994166945,179.49597536039516,,0,0,0,179.49597536039516,65.65913450747586,,0,0,0,65.65913450747586,30.86015700675436,,0,0,0,30.86015700675436,,,0,0,0,
75,SER,7.805765227411477,,0,0,0,7.805765227411477,4.192755052036852,,0,0,0,4.192755052036852,175.69996227668997,,0,0,0,175.69996227668997,61.50031282647907,,0,0,0,61.50031282647907,62.49608066020091,,0,0,0,62.49608066020091,115.04214548426019,,0,0,0,115.04214548426019
76,ALA,7.959580945609946,,0,0,0,7.959580945609946,3.4899375431929185,,0,0,0,3.4899375431929185,178.9564488885004,,0,0,0,178.9564488885004,55.254594500771454,,0,0,0,55.254594500771454,18.547062584454437,,0,0,0,18.547062584454437,124.98607303175157,,0,0,0,124.98607303175157
77,LYS,8.137190752375401,,0,0,0,8.137190752375401,3.732817748751249,,0,0,0,3.732817748751249,178.46693589303473,,0,0,0,178.46693589303473,60.027070021162174,,0,0,0,60.027070021162174,32.585634623748476,,0,0,0,32.585634623748476,118.12205891273727,,0,0,0,118.12205891273727
78,ALA,7.9012865856865355,,0,0,0,7.9012865856865355,4.119581903185703,,0,0,0,4.119581903185703,180.26821901391386,,0,0,0,180.26821901391386,54.76976625700966,,0,0,0,54.76976625700966,18.19247641013986,,0,0,0,18.19247641013986,120.29040567337107,,0,0,0,120.29040567337107
79,ALA,8.156910032289932,,0,0,0,8.156910032289932,4.218307321953047,,0,0,0,4.218307321953047,179.2054239262904,,0,0,0,179.2054239262904,55.591529182922635,,0,0,0,55.591529182922635,18.422313054012655,,0,0,0,18.422313054012655,122.75875288172938,,0,0,0,122.75875288172938
80,ILE,8.19583703117993,,0,0,0,8.19583703117993,3.60772778832834,,0,0,0,3.60772778832834,177.56113900966255,,0,0,0,177.56113900966255,66.31339333030857,,0,0,0,66.31339333030857,37.962543803463205,,0,0,0,37.962543803463205,118.5071846447719,,0,0,0,118.5071846447719
81,ASP,8.127344556765456,,0,0,0,8.127344556765456,4.444821496067821,,0,0,0,4.444821496067821,178.05300089382285,,0,0,0,178.05300089382285,57.22381146703297,,0,0,0,57.22381146703297,40.764994542801645,,0,0,0,40.764994542801645,118.70450744014319,,0,0,0,118.70450744014319
82,TRP,8.172421308408259,,0,0,0,8.172421308408259,4.292513932040182,,0,0,0,4.292513932040182,177.42928848706293,,0,0,0,177.42928848706293,59.76815294555445,,0,0,0,59.76815294555445,29.81280883799534,,0,0,0,29.81280883799534,120.54849746512932,,0,0,0,120.54849746512932
83,PHE,8.287843465878566,,0,0,0,8.287843465878566,4.767596733333333,,0,0,0,4.767596733333333,176.27559563241203,,0,0,0,176.27559563241203,58.640645211627266,,0,0,0,58.640645211627266,40.02922716381951,,0,0,0,40.02922716381951,113.74125078615829,,0,0,0,113.74125078615829
84,ASP,8.390063410767011,,0,0,0,8.390063410767011,4.471691436394162,,0,0,0,4.471691436394162,177.13829121834277,,0,0,0,177.13829121834277,57.166109063369966,,0,0,0,57.166109063369966,41.153486263353315,,0,0,0,41.153486263353315,121.24126528157399,,0,0,0,121.24126528157399
85,GLY,8.887152188999888,,0,0,0,8.887152188999888,4.000230730669331,,0,0,0,4.000230730669331,174.96969424846264,,0,0,0,174.96969424846264,45.68738491694972,,0,0,0,45.68738491694972,,,0,0,0,,116.23385325656011,,0,0,0,116.23385325656011
86,LYS,8.026962378909978,,0,0,0,8.026962378909978,4.406059918742368,,0,0,0,4.406059918742368,175.26090224776888,,0,0,0,175.26090224776888,56.093673845221446,,0,0,0,56.093673845221446,33.611135301465204,,0,0,0,33.611135301465204,121.26336143645244,,0,0,0,121.26336143645244
87,GLU,8.617654665401265,,0,0,0,8.617654665401265,5.0138375587912085,,0,0,0,5.0138375587912085,176.06859386267067,,0,0,0,176.06859386267067,55.385312262515264,,0,0,0,55.385312262515264,31.6690329504551,,0,0,0,31.6690329504551,120.3420897475691,,0,0,0,120.3420897475691
88,PHE,9.273533564496615,,0,0,0,9.273533564496615,4.320377905183705,,0,0,0,4.320377905183705,174.94752622940393,,0,0,0,174.94752622940393,56.84916624001554,,0,0,0,56.84916624001554,41.24932002155067,,0,0,0,41.24932002155067,126.18111264008769,,0,0,0,126.18111264008769
89,SER,8.751458181035632,,0,0,0,8.751458181035632,4.026841371395271,,0,0,0,4.026841371395271,174.50967391083915,,0,0,0,174.50967391083915,58.615806886502384,,0,0,0,58.615806886502384,62.4754450044511,,0,0,0,62.4754450044511,124.13123224633699,,0,0,0,124.13123224633699