RESNUM,RESNAME,H_X,H_Y,H_BEST_REF_SCORE,H_BEST_REF_COV,H_BEST_REF_MATCH,H_UCBShift,HA_X,HA_Y,HA_BEST_REF_SCORE,HA_BEST_REF_COV,HA_BEST_REF_MATCH,HA_UCBShift,C_X,C_Y,C_BEST_REF_SCORE,C_BEST_REF_COV,C_BEST_REF_MATCH,C_UCBShift,CA_X,CA_Y,CA_BEST_REF_SCORE,CA_BEST_REF_COV,CA_BEST_REF_MATCH,CA_UCBShift,CB_X,CB_Y,CB_BEST_REF_SCORE,CB_BEST_REF_COV,CB_BEST_REF_MATCH,CB_UCBShift,N_X,N_Y,N_BEST_REF_SCORE,N_BEST_REF_COV,N_BEST_REF_MATCH,N_UCBShift
1,MET,8.42066468024753,,0,0,0,8.42066468024753,4.406288726368076,,0,0,0,4.406288726368076,174.68254949679766,,0,0,0,174.68254949679766,55.75908261766011,,0,0,0,55.75908261766011,33.11707775738706,,0,0,0,33.11707775738706,121.40230901961371,,0,0,0,121.40230901961371
2,SER,8.513040666511268,,0,0,0,8.513040666511268,4.482706654684205,,0,0,0,4.482706654684205,174.56032793849482,,0,0,0,174.56032793849482,57.98266239045954,,0,0,0,57.98266239045954,63.6853333515096,,0,0,0,63.6853333515096,118.81956649912865,,0,0,0,118.81956649912865
3,GLY,8.234089004329004,,0,0,0,8.234089004329004,3.868351647852148,,0,0,0,3.868351647852148,173.54216658505385,,0,0,0,173.54216658505385,44.85754336945277,,0,0,0,44.85754336945277,,,0,0,0,,111.23415387962592,,0,0,0,111.23415387962592
4,ALA,8.3626224494894,,0,0,0,8.3626224494894,4.290044560567211,,0,0,0,4.290044560567211,176.65765107184484,,0,0,0,176.65765107184484,52.27094464122544,,0,0,0,52.27094464122544,19.2155762483239,,0,0,0,19.2155762483239,125.13128018001443,,0,0,0,125.13128018001443
5,ARG,8.498090685564437,,0,0,0,8.498090685564437,5.28883150993451,,0,0,0,5.28883150993451,175.47223092123434,,0,0,0,175.47223092123434,55.120273726490176,,0,0,0,55.120273726490176,33.30319021433567,,0,0,0,33.30319021433567,120.90850235464535,,0,0,0,120.90850235464535
6,CYS,8.948868647452548,,0,0,0,8.948868647452548,5.408725081057831,,0,0,0,5.408725081057831,172.22338225702075,,0,0,0,172.22338225702075,55.85782145329116,,0,0,0,55.85782145329116,32.33057263341659,,0,0,0,32.33057263341659,118.76034152118437,,0,0,0,118.76034152118437
7,ARG,8.967305055966257,,0,0,0,8.967305055966257,5.265812074725275,,0,0,0,5.265812074725275,175.71732037398712,,0,0,0,175.71732037398712,53.774521685175934,,0,0,0,53.774521685175934,33.31975106433566,,0,0,0,33.31975106433566,122.61888486724942,,0,0,0,122.61888486724942
8,THR,8.856335025502275,,0,0,0,8.856335025502275,4.328834561849262,,0,0,0,4.328834561849262,175.03701505498944,,0,0,0,175.03701505498944,62.73205792587967,,0,0,0,62.73205792587967,69.76053247533022,,0,0,0,69.76053247533022,121.53255269205793,,0,0,0,121.53255269205793
9,LEU,9.236008919042069,,0,0,0,9.236008919042069,4.098268712415362,,0,0,0,4.098268712415362,176.61390790087134,,0,0,0,176.61390790087134,56.051386279659226,,0,0,0,56.051386279659226,42.895292777122876,,0,0,0,42.895292777122876,126.41484492690087,,0,0,0,126.41484492690087
10,TYR,7.694631795476745,,0,0,0,7.694631795476745,4.839507443936619,,0,0,0,4.839507443936619,173.9354348996892,,0,0,0,173.9354348996892,54.914769727411475,,0,0,0,54.914769727411475,40.68485971135531,,0,0,0,40.68485971135531,115.84048743202354,,0,0,0,115.84048743202354
11,PRO,,,0,0,0,,4.549746658136308,,0,0,0,4.549746658136308,176.02275671998004,,0,0,0,176.02275671998004,62.993257138189584,,0,0,0,62.993257138189584,32.03337078147963,,0,0,0,32.03337078147963,,,0,0,0,
12,PHE,8.748822388616938,,0,0,0,8.748822388616938,4.828656828382727,,0,0,0,4.828656828382727,175.5456110823954,,0,0,0,175.5456110823954,56.97223787032412,,0,0,0,56.97223787032412,41.71398882203353,,0,0,0,41.71398882203353,124.0545161943612,,0,0,0,124.0545161943612
13,SER,8.21928723972694,,0,0,0,8.21928723972694,4.344653319075369,,0,0,0,4.344653319075369,174.96377180909644,,0,0,0,174.96377180909644,58.70458121317016,,0,0,0,58.70458121317016,63.63376782165057,,0,0,0,63.63376782165057,121.52172203232878,,0,0,0,121.52172203232878
14,GLY,6.928547135103785,,0,0,0,6.928547135103785,3.57614165481463,,0,0,0,3.57614165481463,174.96279222207238,,0,0,0,174.96279222207238,46.055915457409256,,0,0,0,46.055915457409256,,,0,0,0,,112.85605293298923,,0,0,0,112.85605293298923
15,GLU,8.414038992857142,,0,0,0,8.414038992857142,4.020187451001776,,0,0,0,4.020187451001776,177.4773980621101,,0,0,0,177.4773980621101,58.8992462478355,,0,0,0,58.8992462478355,29.51920497201132,,0,0,0,29.51920497201132,120.71407790757576,,0,0,0,120.71407790757576
16,ARG,8.123805421506272,,0,0,0,8.123805421506272,4.260303502478077,,0,0,0,4.260303502478077,176.0908893013431,,0,0,0,176.0908893013431,56.74031272399822,,0,0,0,56.74031272399822,30.282624189232987,,0,0,0,30.282624189232987,117.79207405751471,,0,0,0,117.79207405751471
17,HIS,7.8454491043734045,,0,0,0,7.8454491043734045,4.50211569000999,,0,0,0,4.50211569000999,175.62105076774893,,0,0,0,175.62105076774893,55.710879355494505,,0,0,0,55.710879355494505,30.669066255716505,,0,0,0,30.669066255716505,118.5058167961816,,0,0,0,118.5058167961816
18,GLY,8.728727266150516,,0,0,0,8.728727266150516,3.967262229290154,,0,0,0,3.967262229290154,174.91710167925407,,0,0,0,174.91710167925407,46.517237361038966,,0,0,0,46.517237361038966,,,0,0,0,,111.4884647519869,,0,0,0,111.4884647519869
19,GLN,8.288826806293706,,0,0,0,8.288826806293706,4.567950876212676,,0,0,0,4.567950876212676,176.08506896870352,,0,0,0,176.08506896870352,55.090712590348545,,0,0,0,55.090712590348545,28.925177132423133,,0,0,0,28.925177132423133,117.58899869189699,,0,0,0,117.58899869189699
20,GLY,7.979445989105339,,0,0,0,7.979445989105339,3.968451110556111,,0,0,0,3.968451110556111,173.64828258638028,,0,0,0,173.64828258638028,45.92388571545122,,0,0,0,45.92388571545122,,,0,0,0,,109.87453367967588,,0,0,0,109.87453367967588
21,LEU,9.044231486679987,,0,0,0,9.044231486679987,4.47606712976468,,0,0,0,4.47606712976468,176.2926701050838,,0,0,0,176.2926701050838,54.64468555672106,,0,0,0,54.64468555672106,42.47058706741591,,0,0,0,42.47058706741591,126.81754981822067,,0,0,0,126.81754981822067
22,ARG,8.425961665073816,,0,0,0,8.425961665073816,4.636279679481629,,0,0,0,4.636279679481629,176.0913496271229,,0,0,0,176.0913496271229,56.22887781283161,,0,0,0,56.22887781283161,30.722136028987677,,0,0,0,30.722136028987677,126.72517672158952,,0,0,0,126.72517672158952
23,PHE,8.881877634632035,,0,0,0,8.881877634632035,5.056645461233211,,0,0,0,5.056645461233211,174.85039710912423,,0,0,0,174.85039710912423,55.72932043836164,,0,0,0,55.72932043836164,41.01151352450883,,0,0,0,41.01151352450883,120.0813542539183,,0,0,0,120.0813542539183
24,ALA,8.93869011112776,,0,0,0,8.93869011112776,4.506098994849595,,0,0,0,4.506098994849595,177.56022614996672,,0,0,0,177.56022614996672,51.22135501807082,,0,0,0,51.22135501807082,20.403316531496284,,0,0,0,20.403316531496284,124.249342102775,,0,0,0,124.249342102775
25,ALA,8.515762311000111,,0,0,0,8.515762311000111,4.087554595121546,,0,0,0,4.087554595121546,178.32949736813188,,0,0,0,178.32949736813188,53.939647126057274,,0,0,0,53.939647126057274,18.375530066067267,,0,0,0,18.375530066067267,123.80158471440781,,0,0,0,123.80158471440781
26,GLY,9.838275954362304,,0,0,0,9.838275954362304,3.9291728124930625,,0,0,0,3.9291728124930625,174.78127871705516,,0,0,0,174.78127871705516,45.0409007991675,,0,0,0,45.0409007991675,,,0,0,0,,111.54960793061937,,0,0,0,111.54960793061937
27,GLU,8.21908590964591,,0,0,0,8.21908590964591,4.354089257453658,,0,0,0,4.354089257453658,175.55786413675213,,0,0,0,175.55786413675213,56.54670887955378,,0,0,0,56.54670887955378,31.152405148562547,,0,0,0,31.152405148562547,121.31088472226662,,0,0,0,121.31088472226662
28,LEU,8.486248518337218,,0,0,0,8.486248518337218,5.145440046137197,,0,0,0,5.145440046137197,176.40644317937617,,0,0,0,176.40644317937617,54.19872682021312,,0,0,0,54.19872682021312,43.765835422932625,,0,0,0,43.765835422932625,122.77566258862804,,0,0,0,122.77566258862804
29,ILE,9.259572343806193,,0,0,0,9.259572343806193,4.543287438011988,,0,0,0,4.543287438011988,174.68903500560552,,0,0,0,174.68903500560552,60.21734863467643,,0,0,0,60.21734863467643,41.14988118277278,,0,0,0,41.14988118277278,121.97792753304473,,0,0,0,121.97792753304473
30,THR,8.878297086746587,,0,0,0,8.878297086746587,4.700299644988345,,0,0,0,4.700299644988345,174.2774225057054,,0,0,0,174.2774225057054,62.66733676472416,,0,0,0,62.66733676472416,68.97505908927184,,0,0,0,68.97505908927184,123.9340525643079,,0,0,0,123.9340525643079
31,LEU,9.010978916167167,,0,0,0,9.010978916167167,4.4166981181429685,,0,0,0,4.4166981181429685,176.4083214592574,,0,0,0,176.4083214592574,56.330141616189366,,0,0,0,56.330141616189366,42.1951804001776,,0,0,0,42.1951804001776,129.73405912134533,,0,0,0,129.73405912134533
32,LEU,9.019990018403819,,0,0,0,9.019990018403819,4.442716791863692,,0,0,0,4.442716791863692,176.8714957148851,,0,0,0,176.8714957148851,55.89949572776668,,0,0,0,55.89949572776668,42.953602246969695,,0,0,0,42.953602246969695,124.8850554522422,,0,0,0,124.8850554522422
33,GLN,7.974080502924854,,0,0,0,7.974080502924854,4.536257356388056,,0,0,0,4.536257356388056,174.78882506520702,,0,0,0,174.78882506520702,55.109609474969474,,0,0,0,55.109609474969474,32.344627247385944,,0,0,0,32.344627247385944,117.31682052029637,,0,0,0,117.31682052029637
34,VAL,8.513262758818959,,0,0,0,8.513262758818959,4.101437918509269,,0,0,0,4.101437918509269,174.50252917067377,,0,0,0,174.50252917067377,59.27667011753246,,0,0,0,59.27667011753246,32.4748470989566,,0,0,0,32.4748470989566,124.31586224493284,,0,0,0,124.31586224493284
35,PRO,,,0,0,0,,4.574110395870796,,0,0,0,4.574110395870796,176.8531017304862,,0,0,0,176.8531017304862,62.79806276194916,,0,0,0,62.79806276194916,32.838571921778225,,0,0,0,32.838571921778225,,,0,0,0,
36,ASP,8.552682670274171,,0,0,0,8.552682670274171,4.53089279005439,,0,0,0,4.53089279005439,176.9828547023865,,0,0,0,176.9828547023865,55.57496487817183,,0,0,0,55.57496487817183,40.39304150360196,,0,0,0,40.39304150360196,121.33025651110556,,0,0,0,121.33025651110556
37,GLY,8.362377317504718,,0,0,0,8.362377317504718,4.004764482625707,,0,0,0,4.004764482625707,175.30196055571096,,0,0,0,175.30196055571096,45.032914606865354,,0,0,0,45.032914606865354,,,0,0,0,,107.51806409052058,,0,0,0,107.51806409052058
38,GLY,8.361439616355867,,0,0,0,8.361439616355867,3.9136901459346207,,0,0,0,3.9136901459346207,173.61260712597957,,0,0,0,173.61260712597957,45.64278877354867,,0,0,0,45.64278877354867,,,0,0,0,,108.25258832479187,,0,0,0,108.25258832479187
39,TRP,7.959731151148851,,0,0,0,7.959731151148851,4.953824903940506,,0,0,0,4.953824903940506,175.42223723600844,,0,0,0,175.42223723600844,56.62183838235653,,0,0,0,56.62183838235653,30.948530551648354,,0,0,0,30.948530551648354,120.63724074628149,,0,0,0,120.63724074628149
40,TRP,8.919423994971694,,0,0,0,8.919423994971694,5.466865727045178,,0,0,0,5.466865727045178,174.3904989169386,,0,0,0,174.3904989169386,53.67096014400599,,0,0,0,53.67096014400599,31.756721701648356,,0,0,0,31.756721701648356,123.64381558084693,,0,0,0,123.64381558084693
41,GLU,8.69319639956155,,0,0,0,8.69319639956155,4.552728938544789,,0,0,0,4.552728938544789,175.6151226703574,,0,0,0,175.6151226703574,54.75574953949384,,0,0,0,54.75574953949384,31.232798087257187,,0,0,0,31.232798087257187,123.58648788855034,,0,0,0,123.58648788855034
42,GLY,9.051843957314908,,0,0,0,9.051843957314908,4.305939869011544,,0,0,0,4.305939869011544,170.41524694916194,,0,0,0,170.41524694916194,45.935544971145525,,0,0,0,45.935544971145525,,,0,0,0,,113.16617238683538,,0,0,0,113.16617238683538
43,GLU,8.861477065639916,,0,0,0,8.861477065639916,5.281723585886335,,0,0,0,5.281723585886335,175.85081909986678,,0,0,0,175.85081909986678,54.2222509507326,,0,0,0,54.2222509507326,33.09287213343878,,0,0,0,33.09287213343878,119.64909732380397,,0,0,0,119.64909732380397
44,LYS,8.845776804340103,,0,0,0,8.845776804340103,4.441581478704629,,0,0,0,4.441581478704629,177.89104693702964,,0,0,0,177.89104693702964,56.156422428549234,,0,0,0,56.156422428549234,33.780007443667444,,0,0,0,33.780007443667444,125.8690227599678,,0,0,0,125.8690227599678
45,GLU,8.971728955666556,,0,0,0,8.971728955666556,4.051497368609169,,0,0,0,4.051497368609169,176.38482483533133,,0,0,0,176.38482483533133,59.08925614282384,,0,0,0,59.08925614282384,29.461285537085136,,0,0,0,29.461285537085136,121.31656617485292,,0,0,0,121.31656617485292
46,ASP,7.998274497696747,,0,0,0,7.998274497696747,4.635043669694195,,0,0,0,4.635043669694195,176.863473539233,,0,0,0,176.863473539233,53.80155575899101,,0,0,0,53.80155575899101,40.20698822127872,,0,0,0,40.20698822127872,118.06138615734267,,0,0,0,118.06138615734267
47,GLY,8.208934183016982,,0,0,0,8.208934183016982,3.9437701303085806,,0,0,0,3.9437701303085806,173.9798405788323,,0,0,0,173.9798405788323,45.55388797476412,,0,0,0,45.55388797476412,,,0,0,0,,109.02391747314353,,0,0,0,109.02391747314353
48,LEU,7.689718764585415,,0,0,0,7.689718764585415,4.3497185315961815,,0,0,0,4.3497185315961815,175.55053668967145,,0,0,0,175.55053668967145,55.23991295155955,,0,0,0,55.23991295155955,42.42850683563103,,0,0,0,42.42850683563103,121.82008933334443,,0,0,0,121.82008933334443
49,ARG,8.40319833957154,,0,0,0,8.40319833957154,5.362739633627483,,0,0,0,5.362739633627483,175.72506575898547,,0,0,0,175.72506575898547,54.148901439244085,,0,0,0,54.148901439244085,33.04349888783994,,0,0,0,33.04349888783994,120.49207538482074,,0,0,0,120.49207538482074
50,GLY,8.806637379270729,,0,0,0,8.806637379270729,4.265198415545566,,0,0,0,4.265198415545566,171.38422826317017,,0,0,0,171.38422826317017,45.81840991401376,,0,0,0,45.81840991401376,,,0,0,0,,108.2067470971806,,0,0,0,108.2067470971806
51,TRP,9.055095261882562,,0,0,0,9.055095261882562,5.380838197857699,,0,0,0,5.380838197857699,176.69636352687868,,0,0,0,176.69636352687868,57.59795718332223,,0,0,0,57.59795718332223,31.19273355971251,,0,0,0,31.19273355971251,120.75966733121878,,0,0,0,120.75966733121878
52,PHE,8.907609127133977,,0,0,0,8.907609127133977,5.076923451065602,,0,0,0,5.076923451065602,171.5500581118548,,0,0,0,171.5500581118548,54.25984831393607,,0,0,0,54.25984831393607,39.64268377864913,,0,0,0,39.64268377864913,117.61477232401488,,0,0,0,117.61477232401488
53,PRO,,,0,0,0,,3.947322391949718,,0,0,0,3.947322391949718,177.7444913255356,,0,0,0,177.7444913255356,62.01599504299034,,0,0,0,62.01599504299034,30.880349501293153,,0,0,0,30.880349501293153,,,0,0,0,
54,ALA,8.236629421583972,,0,0,0,8.236629421583972,3.0090695725191505,,0,0,0,3.0090695725191505,179.21607390016652,,0,0,0,179.21607390016652,54.55785040631036,,0,0,0,54.55785040631036,17.067798930469532,,0,0,0,17.067798930469532,128.93888907155068,,0,0,0,128.93888907155068
55,SER,8.166411947890998,,0,0,0,8.166411947890998,4.187811648035298,,0,0,0,4.187811648035298,175.39209325269175,,0,0,0,175.39209325269175,60.093234720834715,,0,0,0,60.093234720834715,62.830839500111,,0,0,0,62.830839500111,110.17300503603619,,0,0,0,110.17300503603619
56,TYR,7.8418283594572085,,0,0,0,7.8418283594572085,4.721328804834055,,0,0,0,4.721328804834055,174.914062629132,,0,0,0,174.914062629132,57.9526105474248,,0,0,0,57.9526105474248,38.58925080705961,,0,0,0,38.58925080705961,120.43099791517926,,0,0,0,120.43099791517926
57,VAL,7.553461823260072,,0,0,0,7.553461823260072,5.202869675785325,,0,0,0,5.202869675785325,174.30844618222335,,0,0,0,174.30844618222335,58.259726643828394,,0,0,0,58.259726643828394,35.277399026817626,,0,0,0,35.277399026817626,110.30132082096793,,0,0,0,110.30132082096793
58,GLN,8.791510370790322,,0,0,0,8.791510370790322,4.663985987395938,,0,0,0,4.663985987395938,174.95058226821513,,0,0,0,174.95058226821513,54.020425763242315,,0,0,0,54.020425763242315,31.655490516250417,,0,0,0,31.655490516250417,121.41642624614829,,0,0,0,121.41642624614829
59,LEU,8.82817468952159,,0,0,0,8.82817468952159,4.542293452902653,,0,0,0,4.542293452902653,177.0291058928294,,0,0,0,177.0291058928294,56.064731164474416,,0,0,0,56.064731164474416,42.13143254707515,,0,0,0,42.13143254707515,127.14349486466865,,0,0,0,127.14349486466865
60,LEU,8.502541677849928,,0,0,0,8.502541677849928,4.273228359040959,,0,0,0,4.273228359040959,179.61153459391164,,0,0,0,179.61153459391164,56.11865180448441,,0,0,0,56.11865180448441,43.284720199778,,0,0,0,43.284720199778,126.98489529569873,,0,0,0,126.98489529569873
