RESNUM,RESNAME,H_X,H_Y,H_BEST_REF_SCORE,H_BEST_REF_COV,H_BEST_REF_MATCH,H_UCBShift,HA_X,HA_Y,HA_BEST_REF_SCORE,HA_BEST_REF_COV,HA_BEST_REF_MATCH,HA_UCBShift,C_X,C_Y,C_BEST_REF_SCORE,C_BEST_REF_COV,C_BEST_REF_MATCH,C_UCBShift,CA_X,CA_Y,CA_BEST_REF_SCORE,CA_BEST_REF_COV,CA_BEST_REF_MATCH,CA_UCBShift,CB_X,CB_Y,CB_BEST_REF_SCORE,CB_BEST_REF_COV,CB_BEST_REF_MATCH,CB_UCBShift,N_X,N_Y,N_BEST_REF_SCORE,N_BEST_REF_COV,N_BEST_REF_MATCH,N_UCBShift
1,MET,8.305211547879898,,0,0,0,8.305211547879898,4.706760636896437,,0,0,0,4.706760636896437,173.49935819229657,,0,0,0,173.49935819229657,53.166668966838714,,0,0,0,53.166668966838714,32.6662145500111,,0,0,0,32.6662145500111,121.97680378662449,,0,0,0,121.97680378662449
2,PRO,,,0,0,0,,4.467180378604729,,0,0,0,4.467180378604729,177.17945508522035,,0,0,0,177.17945508522035,62.83550327934288,,0,0,0,62.83550327934288,32.18994195260295,,0,0,0,32.18994195260295,,,0,0,0,
3,LYS,8.436698445976246,,0,0,0,8.436698445976246,4.35861637036297,,0,0,0,4.35861637036297,177.02797445294703,,0,0,0,177.02797445294703,56.2849213959818,,0,0,0,56.2849213959818,32.945282123038076,,0,0,0,32.945282123038076,122.43963630469531,,0,0,0,122.43963630469531
4,SER,8.445203312526363,,0,0,0,8.445203312526363,4.46226102029082,,0,0,0,4.46226102029082,174.1742204143412,,0,0,0,174.1742204143412,58.6957318075258,,0,0,0,58.6957318075258,63.77120598571428,,0,0,0,63.77120598571428,118.2364448405983,,0,0,0,118.2364448405983
5,LEU,8.332093813702963,,0,0,0,8.332093813702963,4.6513019997891005,,0,0,0,4.6513019997891005,175.5058201406649,,0,0,0,175.5058201406649,54.38724587485292,,0,0,0,54.38724587485292,42.76842946362526,,0,0,0,42.76842946362526,125.19173386718836,,0,0,0,125.19173386718836
6,THR,8.515528475607725,,0,0,0,8.515528475607725,5.263368467382617,,0,0,0,5.263368467382617,174.18001185704296,,0,0,0,174.18001185704296,60.57010157153957,,0,0,0,60.57010157153957,70.45010657837163,,0,0,0,70.45010657837163,117.71456472183927,,0,0,0,117.71456472183927
7,PHE,9.3468715490121,,0,0,0,9.3468715490121,4.874310718919968,,0,0,0,4.874310718919968,173.1032500429182,,0,0,0,173.1032500429182,56.891166416888666,,0,0,0,56.891166416888666,42.71820563924409,,0,0,0,42.71820563924409,125.65760129048729,,0,0,0,125.65760129048729
8,GLU,7.461529022954824,,0,0,0,7.461529022954824,5.1443080015429015,,0,0,0,5.1443080015429015,174.71855156865357,,0,0,0,174.71855156865357,54.89639372727273,,0,0,0,54.89639372727273,32.657589627000775,,0,0,0,32.657589627000775,126.4910299939616,,0,0,0,126.4910299939616
9,ASP,8.658293967587968,,0,0,0,8.658293967587968,4.864309491896992,,0,0,0,4.864309491896992,174.18480759816296,,0,0,0,174.18480759816296,53.51359006827617,,0,0,0,53.51359006827617,44.7684948919192,,0,0,0,44.7684948919192,124.99559236230992,,0,0,0,124.99559236230992
10,SER,8.501916187179487,,0,0,0,8.501916187179487,5.407147925413476,,0,0,0,5.407147925413476,173.194239559546,,0,0,0,173.194239559546,57.17484574653124,,0,0,0,57.17484574653124,65.6209608106227,,0,0,0,65.6209608106227,117.56747185513376,,0,0,0,117.56747185513376
11,ILE,9.261933306787657,,0,0,0,9.261933306787657,4.574462219849595,,0,0,0,4.574462219849595,174.0421749952825,,0,0,0,174.0421749952825,59.71211455788101,,0,0,0,59.71211455788101,42.17288034494949,,0,0,0,42.17288034494949,124.10327119013765,,0,0,0,124.10327119013765
12,ASN,8.872222235325786,,0,0,0,8.872222235325786,5.131599992052393,,0,0,0,5.131599992052393,174.5409005427961,,0,0,0,174.5409005427961,52.86527377824953,,0,0,0,52.86527377824953,40.032507771983575,,0,0,0,40.032507771983575,124.23724634062049,,0,0,0,124.23724634062049
13,ILE,9.187239901653902,,0,0,0,9.187239901653902,4.498393746181597,,0,0,0,4.498393746181597,175.31107424275726,,0,0,0,175.31107424275726,60.38127843735154,,0,0,0,60.38127843735154,39.39833327095127,,0,0,0,39.39833327095127,124.79544137458097,,0,0,0,124.79544137458097
14,ALA,8.814231073165724,,0,0,0,8.814231073165724,4.3188831333166835,,0,0,0,4.3188831333166835,176.6114532851371,,0,0,0,176.6114532851371,53.04260444284604,,0,0,0,53.04260444284604,18.553016177922082,,0,0,0,18.553016177922082,130.54269075925743,,0,0,0,130.54269075925743
15,ALA,8.174709428654678,,0,0,0,8.174709428654678,4.726687238844489,,0,0,0,4.726687238844489,174.75905771730493,,0,0,0,174.75905771730493,49.58483648579199,,0,0,0,49.58483648579199,19.9440891483905,,0,0,0,19.9440891483905,122.86068203467089,,0,0,0,122.86068203467089
16,PRO,,,0,0,0,,4.512897254378954,,0,0,0,4.512897254378954,178.25359007022422,,0,0,0,178.25359007022422,63.00709829574314,,0,0,0,63.00709829574314,32.45230478242868,,0,0,0,32.45230478242868,,,0,0,0,
17,ILE,8.774326731734932,,0,0,0,8.774326731734932,4.089981642121768,,0,0,0,4.089981642121768,177.04858499089244,,0,0,0,177.04858499089244,64.49129637904318,,0,0,0,64.49129637904318,37.7185560035298,,0,0,0,37.7185560035298,124.21543361090022,,0,0,0,124.21543361090022
18,ASN,8.590129818364968,,0,0,0,8.590129818364968,4.532388889652015,,0,0,0,4.532388889652015,177.57001379427794,,0,0,0,177.57001379427794,56.42884159887335,,0,0,0,56.42884159887335,37.90247041582862,,0,0,0,37.90247041582862,119.3279300910978,,0,0,0,119.3279300910978
19,GLN,8.038564732262182,,0,0,0,8.038564732262182,4.1403470526695525,,0,0,0,4.1403470526695525,178.40648763795093,,0,0,0,178.40648763795093,58.57765593729049,,0,0,0,58.57765593729049,28.95721259108114,,0,0,0,28.95721259108114,120.73392368346099,,0,0,0,120.73392368346099
20,VAL,8.037705544705295,,0,0,0,8.037705544705295,3.4778729667721167,,0,0,0,3.4778729667721167,177.87354409791877,,0,0,0,177.87354409791877,67.1895846137418,,0,0,0,67.1895846137418,31.577158774919525,,0,0,0,31.577158774919525,120.85026663612499,,0,0,0,120.85026663612499
21,TYR,9.395317242346543,,0,0,0,9.395317242346543,4.002916211754912,,0,0,0,4.002916211754912,177.95893970626597,,0,0,0,177.95893970626597,62.21581554691975,,0,0,0,62.21581554691975,38.74977176595626,,0,0,0,38.74977176595626,120.63265470879675,,0,0,0,120.63265470879675
22,ALA,8.149938300993451,,0,0,0,8.149938300993451,3.851818484537685,,0,0,0,3.851818484537685,180.13041080344655,,0,0,0,180.13041080344655,55.02692054119769,,0,0,0,55.02692054119769,18.124553891541794,,0,0,0,18.124553891541794,123.20565791921966,,0,0,0,123.20565791921966
23,LEU,8.101261305211455,,0,0,0,8.101261305211455,4.121829783200133,,0,0,0,4.121829783200133,178.86820916002884,,0,0,0,178.86820916002884,57.46888187727828,,0,0,0,57.46888187727828,42.20055773135198,,0,0,0,42.20055773135198,120.64985035107115,,0,0,0,120.64985035107115
24,VAL,8.431734283904984,,0,0,0,8.431734283904984,3.332571958208458,,0,0,0,3.332571958208458,177.5043863675436,,0,0,0,177.5043863675436,65.71302789028749,,0,0,0,65.71302789028749,31.33092006666112,,0,0,0,31.33092006666112,117.88250975692641,,0,0,0,117.88250975692641
25,SER,8.093093901687203,,0,0,0,8.093093901687203,3.4039713553668554,,0,0,0,3.4039713553668554,174.4104887520868,,0,0,0,174.4104887520868,59.37976907762793,,0,0,0,59.37976907762793,63.327985064269065,,0,0,0,63.327985064269065,112.44216714452214,,0,0,0,112.44216714452214
26,ASP,7.649338336557886,,0,0,0,7.649338336557886,4.739852174322899,,0,0,0,4.739852174322899,176.5547030962926,,0,0,0,176.5547030962926,53.12599269390054,,0,0,0,53.12599269390054,39.85510333755689,,0,0,0,39.85510333755689,123.32019189116994,,0,0,0,123.32019189116994
27,ILE,7.651847061782662,,0,0,0,7.651847061782662,3.872167088120214,,0,0,0,3.872167088120214,177.10525206653347,,0,0,0,177.10525206653347,62.50814672763903,,0,0,0,62.50814672763903,36.99763244937285,,0,0,0,36.99763244937285,120.1560143980353,,0,0,0,120.1560143980353
28,THR,8.112484412243312,,0,0,0,8.112484412243312,4.008431862909312,,0,0,0,4.008431862909312,176.31097122867132,,0,0,0,176.31097122867132,64.39838019109779,,0,0,0,64.39838019109779,68.81187427025196,,0,0,0,68.81187427025196,113.55895981729381,,0,0,0,113.55895981729381
29,ARG,7.54127106978022,,0,0,0,7.54127106978022,4.156203887279387,,0,0,0,4.156203887279387,177.4314500979909,,0,0,0,177.4314500979909,56.63000278027528,,0,0,0,56.63000278027528,30.454877519552667,,0,0,0,30.454877519552667,119.94849206303697,,0,0,0,119.94849206303697
30,THR,7.480273051110001,,0,0,0,7.480273051110001,3.0726336928848927,,0,0,0,3.0726336928848927,175.77762277777776,,0,0,0,175.77762277777776,66.31090563362193,,0,0,0,66.31090563362193,67.61356591597291,,0,0,0,67.61356591597291,116.80690276432456,,0,0,0,116.80690276432456
31,GLY,7.662751882067933,,0,0,0,7.662751882067933,3.7226301109806874,,0,0,0,3.7226301109806874,175.73410990004996,,0,0,0,175.73410990004996,46.234977148174046,,0,0,0,46.234977148174046,,,0,0,0,,108.5248554126429,,0,0,0,108.5248554126429
32,GLU,7.969144791364191,,0,0,0,7.969144791364191,4.138203892551893,,0,0,0,4.138203892551893,177.78526394577088,,0,0,0,177.78526394577088,58.33510143000888,,0,0,0,58.33510143000888,30.139512625224775,,0,0,0,30.139512625224775,119.7602694941503,,0,0,0,119.7602694941503
33,TRP,7.162506948906647,,0,0,0,7.162506948906647,4.804380150299702,,0,0,0,4.804380150299702,175.73946361045066,,0,0,0,175.73946361045066,57.974777665262515,,0,0,0,57.974777665262515,31.184594659235213,,0,0,0,31.184594659235213,115.10913377646243,,0,0,0,115.10913377646243
34,SER,7.937443434143634,,0,0,0,7.937443434143634,4.942692258436009,,0,0,0,4.942692258436009,173.6694105575924,,0,0,0,173.6694105575924,55.5329679515651,,0,0,0,55.5329679515651,63.48481301650016,,0,0,0,63.48481301650016,118.3360227520091,,0,0,0,118.3360227520091
35,PRO,,,0,0,0,,4.393479206243756,,0,0,0,4.393479206243756,177.58396168465424,,0,0,0,177.58396168465424,64.47248738065822,,0,0,0,64.47248738065822,31.846106905172608,,0,0,0,31.846106905172608,,,0,0,0,
36,VAL,7.604807027661227,,0,0,0,7.604807027661227,4.245814528343878,,0,0,0,4.245814528343878,175.01390375593851,,0,0,0,175.01390375593851,61.98885088534244,,0,0,0,61.98885088534244,32.22035404958375,,0,0,0,32.22035404958375,111.02834141224331,,0,0,0,111.02834141224331
37,CYS,7.633514904667555,,0,0,0,7.633514904667555,4.431848543251193,,0,0,0,4.431848543251193,173.61325336112776,,0,0,0,173.61325336112776,59.08769923347209,,0,0,0,59.08769923347209,27.47450328946609,,0,0,0,27.47450328946609,120.06927062641248,,0,0,0,120.06927062641248
38,GLU,8.928244093517593,,0,0,0,8.928244093517593,4.184795222699522,,0,0,0,4.184795222699522,176.48144647788322,,0,0,0,176.48144647788322,57.94452893337218,,0,0,0,57.94452893337218,31.38930422965923,,0,0,0,31.38930422965923,126.24347594909536,,0,0,0,126.24347594909536
39,LYS,7.707264179170829,,0,0,0,7.707264179170829,4.578789502031302,,0,0,0,4.578789502031302,174.28872952978134,,0,0,0,174.28872952978134,55.56031698574204,,0,0,0,55.56031698574204,36.37168674228549,,0,0,0,36.37168674228549,115.26884604057054,,0,0,0,115.26884604057054
40,CYS,8.584171143428794,,0,0,0,8.584171143428794,5.230474625180374,,0,0,0,5.230474625180374,172.98610608120768,,0,0,0,172.98610608120768,57.35982559909535,,0,0,0,57.35982559909535,31.63418810875236,,0,0,0,31.63418810875236,119.89855322010767,,0,0,0,119.89855322010767
41,TRP,8.368171808913308,,0,0,0,8.368171808913308,4.715263062198913,,0,0,0,4.715263062198913,173.37694443640802,,0,0,0,173.37694443640802,55.96492796032301,,0,0,0,55.96492796032301,31.691733543484297,,0,0,0,31.691733543484297,120.37896657483073,,0,0,0,120.37896657483073
42,TRP,8.77766742940393,,0,0,0,8.77766742940393,4.948979031618382,,0,0,0,4.948979031618382,176.25489391271506,,0,0,0,176.25489391271506,57.57334896259851,,0,0,0,57.57334896259851,29.80215880934066,,0,0,0,29.80215880934066,122.25329091452436,,0,0,0,122.25329091452436
43,ASP,9.199320906882008,,0,0,0,9.199320906882008,4.65150307532745,,0,0,0,4.65150307532745,177.21520640479523,,0,0,0,177.21520640479523,56.1102964445832,,0,0,0,56.1102964445832,41.2820416489011,,0,0,0,41.2820416489011,123.64906076209903,,0,0,0,123.64906076209903
44,GLU,8.465747383782883,,0,0,0,8.465747383782883,4.512262015023865,,0,0,0,4.512262015023865,175.9705012611,,0,0,0,175.9705012611,55.826286354695306,,0,0,0,55.826286354695306,30.06951875931846,,0,0,0,30.06951875931846,116.92597099923411,,0,0,0,116.92597099923411
45,ASP,8.34538665064935,,0,0,0,8.34538665064935,4.526682476126651,,0,0,0,4.526682476126651,176.48830253024198,,0,0,0,176.48830253024198,55.47250887662338,,0,0,0,55.47250887662338,40.65829553937729,,0,0,0,40.65829553937729,119.14326245659896,,0,0,0,119.14326245659896
46,GLU,8.421694121023421,,0,0,0,8.421694121023421,4.194898432983683,,0,0,0,4.194898432983683,176.9657555630092,,0,0,0,176.9657555630092,56.98357061291486,,0,0,0,56.98357061291486,30.282505036019536,,0,0,0,30.282505036019536,117.87247165000001,,0,0,0,117.87247165000001
47,GLY,7.140118300799203,,0,0,0,7.140118300799203,3.273950221842048,,0,0,0,3.273950221842048,173.51824606270952,,0,0,0,173.51824606270952,44.02707632107892,,0,0,0,44.02707632107892,,,0,0,0,,107.70358703575869,,0,0,0,107.70358703575869
48,PRO,,,0,0,0,,4.256259234659785,,0,0,0,4.256259234659785,174.3100456954601,,0,0,0,174.3100456954601,62.37648102454767,,0,0,0,62.37648102454767,28.875610659945615,,0,0,0,28.875610659945615,,,0,0,0,
49,VAL,7.871653559817959,,0,0,0,7.871653559817959,4.446499257181707,,0,0,0,4.446499257181707,176.43143637454213,,0,0,0,176.43143637454213,60.29029056683317,,0,0,0,60.29029056683317,33.853614625080475,,0,0,0,33.853614625080475,118.0957711913642,,0,0,0,118.0957711913642
50,VAL,8.425627754978354,,0,0,0,8.425627754978354,3.4479966703518707,,0,0,0,3.4479966703518707,177.42664907625152,,0,0,0,177.42664907625152,65.41983311411367,,0,0,0,65.41983311411367,31.043447386596736,,0,0,0,31.043447386596736,123.7521051339938,,0,0,0,123.7521051339938
51,GLY,9.043546001770451,,0,0,0,9.043546001770451,4.058727976526251,,0,0,0,4.058727976526251,174.6826639848485,,0,0,0,174.6826639848485,44.88859877160617,,0,0,0,44.88859877160617,,,0,0,0,,116.1143423450494,,0,0,0,116.1143423450494
52,ALA,8.17643178958819,,0,0,0,8.17643178958819,4.297906428282829,,0,0,0,4.297906428282829,175.90009534663116,,0,0,0,175.90009534663116,52.50144117675658,,0,0,0,52.50144117675658,19.840345694516596,,0,0,0,19.840345694516596,124.72792210647685,,0,0,0,124.72792210647685
53,HIS,8.958548342624042,,0,0,0,8.958548342624042,5.503217951420802,,0,0,0,5.503217951420802,174.69732072729494,,0,0,0,174.69732072729494,54.98879173741814,,0,0,0,54.98879173741814,31.611413792440892,,0,0,0,31.611413792440892,118.6873003884449,,0,0,0,118.6873003884449
54,PHE,9.13166343976024,,0,0,0,9.13166343976024,5.261613153141303,,0,0,0,5.261613153141303,172.62558333086358,,0,0,0,172.62558333086358,55.52737065400156,,0,0,0,55.52737065400156,42.305854902930406,,0,0,0,42.305854902930406,120.35975625816961,,0,0,0,120.35975625816961
55,THR,8.503821795165946,,0,0,0,8.503821795165946,4.7599905869852375,,0,0,0,4.7599905869852375,172.97812026852037,,0,0,0,172.97812026852037,61.37858109719725,,0,0,0,61.37858109719725,69.17740980010545,,0,0,0,69.17740980010545,117.86490534284049,,0,0,0,117.86490534284049
56,GLY,9.032278238306139,,0,0,0,9.032278238306139,3.735296460952936,,0,0,0,3.735296460952936,172.2311613919303,,0,0,0,172.2311613919303,44.470386272599626,,0,0,0,44.470386272599626,,,0,0,0,,115.55633823240649,,0,0,0,115.55633823240649
57,ARG,8.856175533799535,,0,0,0,8.856175533799535,4.584407208103008,,0,0,0,4.584407208103008,174.41789323024753,,0,0,0,174.41789323024753,55.41232756331446,,0,0,0,55.41232756331446,31.453369373493175,,0,0,0,31.453369373493175,126.26859289442224,,0,0,0,126.26859289442224
58,ASN,8.79032557004662,,0,0,0,8.79032557004662,5.2528734674769675,,0,0,0,5.2528734674769675,173.71616069766344,,0,0,0,173.71616069766344,52.34391075920746,,0,0,0,52.34391075920746,38.94303564039849,,0,0,0,38.94303564039849,125.86563923353869,,0,0,0,125.86563923353869
59,VAL,8.726316823182373,,0,0,0,8.726316823182373,4.321469151903652,,0,0,0,4.321469151903652,175.515552433794,,0,0,0,175.515552433794,61.9057772548063,,0,0,0,61.9057772548063,33.26024558190143,,0,0,0,33.26024558190143,125.7055186872683,,0,0,0,125.7055186872683
60,THR,8.789955066638917,,0,0,0,8.789955066638917,4.807728714396714,,0,0,0,4.807728714396714,173.41620186052836,,0,0,0,173.41620186052836,58.98895858190698,,0,0,0,58.98895858190698,69.32808575899655,,0,0,0,69.32808575899655,120.28993693512598,,0,0,0,120.28993693512598
61,PRO,,,0,0,0,,4.473726779076479,,0,0,0,4.473726779076479,177.27740876649463,,0,0,0,177.27740876649463,64.55477666638916,,0,0,0,64.55477666638916,31.59965375732601,,0,0,0,31.59965375732601,,,0,0,0,
62,GLU,8.417851809002109,,0,0,0,8.417851809002109,4.329366319308469,,0,0,0,4.329366319308469,176.57457547915416,,0,0,0,176.57457547915416,57.44130056565657,,0,0,0,57.44130056565657,30.294710795032746,,0,0,0,30.294710795032746,117.12909920826397,,0,0,0,117.12909920826397
63,ARG,8.187367157803308,,0,0,0,8.187367157803308,4.707340271694972,,0,0,0,4.707340271694972,174.41829829806306,,0,0,0,174.41829829806306,55.7020069517205,,0,0,0,55.7020069517205,33.05173739180819,,0,0,0,33.05173739180819,119.53957782472527,,0,0,0,119.53957782472527
64,THR,8.53720879021534,,0,0,0,8.53720879021534,5.401838892435343,,0,0,0,5.401838892435343,174.0859720678044,,0,0,0,174.0859720678044,61.703951015517816,,0,0,0,61.703951015517816,70.0827285957931,,0,0,0,70.0827285957931,119.21297340308024,,0,0,0,119.21297340308024
65,TRP,8.955538077122878,,0,0,0,8.955538077122878,4.775386105605506,,0,0,0,4.775386105605506,173.42552479126982,,0,0,0,173.42552479126982,56.11792397615717,,0,0,0,56.11792397615717,31.762327816638916,,0,0,0,31.762327816638916,125.877604949001,,0,0,0,125.877604949001
66,GLU,8.775537694194695,,0,0,0,8.775537694194695,5.0129703700521695,,0,0,0,5.0129703700521695,176.056499387235,,0,0,0,176.056499387235,55.34776623933844,,0,0,0,55.34776623933844,31.57086613056388,,0,0,0,31.57086613056388,121.6259924578033,,0,0,0,121.6259924578033
67,THR,9.005932513736264,,0,0,0,9.005932513736264,4.695523051720501,,0,0,0,4.695523051720501,173.15665419024862,,0,0,0,173.15665419024862,61.562095190537235,,0,0,0,61.562095190537235,70.84295079730269,,0,0,0,70.84295079730269,120.1553984210345,,0,0,0,120.1553984210345
68,ARG,8.941022951509602,,0,0,0,8.941022951509602,4.779106978571429,,0,0,0,4.779106978571429,175.29311642372073,,0,0,0,175.29311642372073,55.77583912502497,,0,0,0,55.77583912502497,31.745750358280606,,0,0,0,31.745750358280606,128.32319536891995,,0,0,0,128.32319536891995
69,SER,8.667292416078366,,0,0,0,8.667292416078366,5.446306180597181,,0,0,0,5.446306180597181,171.92952236535686,,0,0,0,171.92952236535686,57.30581578105783,,0,0,0,57.30581578105783,65.50286219517149,,0,0,0,65.50286219517149,121.24949177180044,,0,0,0,121.24949177180044
70,GLU,9.027116762937064,,0,0,0,9.027116762937064,5.069696432739482,,0,0,0,5.069696432739482,175.85701511833167,,0,0,0,175.85701511833167,54.04160932467533,,0,0,0,54.04160932467533,33.37609819398934,,0,0,0,33.37609819398934,124.98536467379843,,0,0,0,124.98536467379843
71,VAL,9.343469222788322,,0,0,0,9.343469222788322,4.093868336682761,,0,0,0,4.093868336682761,176.6994053801754,,0,0,0,176.6994053801754,64.30160955701521,,0,0,0,64.30160955701521,31.649715920601622,,0,0,0,31.649715920601622,127.14164943659674,,0,0,0,127.14164943659674
72,ILE,9.061122368104119,,0,0,0,9.061122368104119,4.422203478404929,,0,0,0,4.422203478404929,175.7173262562826,,0,0,0,175.7173262562826,61.30620774148629,,0,0,0,61.30620774148629,39.14353087515262,,0,0,0,39.14353087515262,124.42530545340772,,0,0,0,124.42530545340772
73,VAL,8.375357878432679,,0,0,0,8.375357878432679,4.433317286069486,,0,0,0,4.433317286069486,174.30138212427573,,0,0,0,174.30138212427573,61.63511460328561,,0,0,0,61.63511460328561,35.20935826989122,,0,0,0,35.20935826989122,119.90263476901433,,0,0,0,119.90263476901433
74,ALA,8.808449353241203,,0,0,0,8.808449353241203,5.195149601126651,,0,0,0,5.195149601126651,175.24208111552892,,0,0,0,175.24208111552892,51.834460876379175,,0,0,0,51.834460876379175,20.415664029947834,,0,0,0,20.415664029947834,129.09356714140858,,0,0,0,129.09356714140858
75,GLU,8.871149513220113,,0,0,0,8.871149513220113,4.807718528160728,,0,0,0,4.807718528160728,174.4024060419081,,0,0,0,174.4024060419081,52.74646868032523,,0,0,0,52.74646868032523,30.733589857814408,,0,0,0,30.733589857814408,124.76447093582529,,0,0,0,124.76447093582529
76,PRO,,,0,0,0,,3.6474001108308363,,0,0,0,3.6474001108308363,176.17267528038627,,0,0,0,176.17267528038627,63.58937274455544,,0,0,0,63.58937274455544,31.571168865379068,,0,0,0,31.571168865379068,,,0,0,0,
77,ASN,7.798059564529915,,0,0,0,7.798059564529915,4.240736542396493,,0,0,0,4.240736542396493,174.29629323045842,,0,0,0,174.29629323045842,54.58159873083583,,0,0,0,54.58159873083583,38.055850065706515,,0,0,0,38.055850065706515,115.30138500421246,,0,0,0,115.30138500421246
78,ARG,7.938259341253191,,0,0,0,7.938259341253191,4.571964141708292,,0,0,0,4.571964141708292,174.99518510528918,,0,0,0,174.99518510528918,57.53770561840937,,0,0,0,57.53770561840937,33.06988533362748,,0,0,0,33.06988533362748,117.44846373252858,,0,0,0,117.44846373252858
79,CYS,8.352300832034633,,0,0,0,8.352300832034633,5.465588934870684,,0,0,0,5.465588934870684,172.18812267666777,,0,0,0,172.18812267666777,57.84180838963259,,0,0,0,57.84180838963259,30.074514241475192,,0,0,0,30.074514241475192,118.10906803255632,,0,0,0,118.10906803255632
80,PHE,9.596110410611612,,0,0,0,9.596110410611612,5.469448225380175,,0,0,0,5.469448225380175,173.57159118825064,,0,0,0,173.57159118825064,55.71201301926962,,0,0,0,55.71201301926962,42.41257372454768,,0,0,0,42.41257372454768,127.774132156882,,0,0,0,127.774132156882
81,GLY,8.912731256154956,,0,0,0,8.912731256154956,4.336847869347319,,0,0,0,4.336847869347319,171.9380512894883,,0,0,0,171.9380512894883,45.45112557313242,,0,0,0,45.45112557313242,,,0,0,0,,113.57839611037296,,0,0,0,113.57839611037296
82,TRP,8.978588874259072,,0,0,0,8.978588874259072,5.511693357797759,,0,0,0,5.511693357797759,173.65707860434566,,0,0,0,173.65707860434566,55.45277797609613,,0,0,0,55.45277797609613,32.3476519941836,,0,0,0,32.3476519941836,120.96795408420468,,0,0,0,120.96795408420468
83,SER,9.402828992007992,,0,0,0,9.402828992007992,5.494508752686204,,0,0,0,5.494508752686204,173.72011015236984,,0,0,0,173.72011015236984,56.67151283238983,,0,0,0,56.67151283238983,65.45070444513264,,0,0,0,65.45070444513264,116.28747699430015,,0,0,0,116.28747699430015
84,VAL,9.3096818009324,,0,0,0,9.3096818009324,4.602580802614052,,0,0,0,4.602580802614052,175.97356409024866,,0,0,0,175.97356409024866,61.51735748822289,,0,0,0,61.51735748822289,33.44683357034632,,0,0,0,33.44683357034632,126.45649372393163,,0,0,0,126.45649372393163
85,THR,8.757282387151738,,0,0,0,8.757282387151738,4.002699959437784,,0,0,0,4.002699959437784,174.5532051584471,,0,0,0,174.5532051584471,63.224370571073365,,0,0,0,63.224370571073365,67.25943303769563,,0,0,0,67.25943303769563,123.11131628013098,,0,0,0,123.11131628013098
86,ASP,8.458750423337774,,0,0,0,8.458750423337774,4.411797371012321,,0,0,0,4.411797371012321,176.16237323155178,,0,0,0,176.16237323155178,55.253699352269955,,0,0,0,55.253699352269955,40.253520533583085,,0,0,0,40.253520533583085,119.56750631389721,,0,0,0,119.56750631389721
87,GLY,8.222359032495282,,0,0,0,8.222359032495282,3.9791827948190703,,0,0,0,3.9791827948190703,174.5894407078255,,0,0,0,174.5894407078255,45.63887452402597,,0,0,0,45.63887452402597,,,0,0,0,,104.92597261450771,,0,0,0,104.92597261450771
88,ASN,7.959908741580642,,0,0,0,7.959908741580642,4.5222552154956155,,0,0,0,4.5222552154956155,174.65665388697968,,0,0,0,174.65665388697968,55.45885905703741,,0,0,0,55.45885905703741,39.5041293568931,,0,0,0,39.5041293568931,118.53579236655567,,0,0,0,118.53579236655567
89,VAL,7.804603704384504,,0,0,0,7.804603704384504,4.7123733306027304,,0,0,0,4.7123733306027304,174.37086228486515,,0,0,0,174.37086228486515,60.28231077987568,,0,0,0,60.28231077987568,35.44913178384949,,0,0,0,35.44913178384949,117.98500878087468,,0,0,0,117.98500878087468
90,LYS,8.768288426778776,,0,0,0,8.768288426778776,5.161357410794761,,0,0,0,5.161357410794761,174.46391173673547,,0,0,0,174.46391173673547,54.618455202941504,,0,0,0,54.618455202941504,36.00024480407371,,0,0,0,36.00024480407371,125.3957152337718,,0,0,0,125.3957152337718