RESNUM,RESNAME,H_X,H_Y,H_BEST_REF_SCORE,H_BEST_REF_COV,H_BEST_REF_MATCH,H_UCBShift,HA_X,HA_Y,HA_BEST_REF_SCORE,HA_BEST_REF_COV,HA_BEST_REF_MATCH,HA_UCBShift,C_X,C_Y,C_BEST_REF_SCORE,C_BEST_REF_COV,C_BEST_REF_MATCH,C_UCBShift,CA_X,CA_Y,CA_BEST_REF_SCORE,CA_BEST_REF_COV,CA_BEST_REF_MATCH,CA_UCBShift,CB_X,CB_Y,CB_BEST_REF_SCORE,CB_BEST_REF_COV,CB_BEST_REF_MATCH,CB_UCBShift,N_X,N_Y,N_BEST_REF_SCORE,N_BEST_REF_COV,N_BEST_REF_MATCH,N_UCBShift
1,MET,8.341539356066155,,0,0,0,8.341539356066155,4.370204573926074,,0,0,0,4.370204573926074,175.1469013107559,,0,0,0,175.1469013107559,55.108401309468306,,0,0,0,55.108401309468306,33.11768590963481,,0,0,0,33.11768590963481,120.96993338444888,,0,0,0,120.96993338444888
2,MET,8.43878635027195,,0,0,0,8.43878635027195,4.782016193267843,,0,0,0,4.782016193267843,174.53913122398157,,0,0,0,174.53913122398157,53.405552336885336,,0,0,0,53.405552336885336,32.45301146006771,,0,0,0,32.45301146006771,123.54949406988013,,0,0,0,123.54949406988013
3,PRO,,,0,0,0,,4.459508191774892,,0,0,0,4.459508191774892,176.71907695239761,,0,0,0,176.71907695239761,63.31069336248751,,0,0,0,63.31069336248751,31.975127610422913,,0,0,0,31.975127610422913,,,0,0,0,
4,ASN,8.236757432484183,,0,0,0,8.236757432484183,4.721817206898657,,0,0,0,4.721817206898657,174.57218086305915,,0,0,0,174.57218086305915,53.32930880953491,,0,0,0,53.32930880953491,38.54540439049284,,0,0,0,38.54540439049284,119.67610637160618,,0,0,0,119.67610637160618
5,LYS,8.300014247796646,,0,0,0,8.300014247796646,4.31287841998557,,0,0,0,4.31287841998557,175.69348846742702,,0,0,0,175.69348846742702,55.967318673010325,,0,0,0,55.967318673010325,32.8604409478577,,0,0,0,32.8604409478577,122.54842335703187,,0,0,0,122.54842335703187
6,VAL,7.865285514996114,,0,0,0,7.865285514996114,4.0758797042180035,,0,0,0,4.0758797042180035,176.25599172309913,,0,0,0,176.25599172309913,62.03324121682762,,0,0,0,62.03324121682762,32.33179274225219,,0,0,0,32.33179274225219,120.10136237294928,,0,0,0,120.10136237294928
7,ARG,8.423465928071929,,0,0,0,8.423465928071929,4.327406872960373,,0,0,0,4.327406872960373,176.07509177111777,,0,0,0,176.07509177111777,56.63058680387945,,0,0,0,56.63058680387945,30.769195805982903,,0,0,0,30.769195805982903,126.53335524679764,,0,0,0,126.53335524679764
8,LYS,8.735658475047174,,0,0,0,8.735658475047174,4.263133405883006,,0,0,0,4.263133405883006,177.96152413242868,,0,0,0,177.96152413242868,56.195134901509604,,0,0,0,56.195134901509604,33.12740915966256,,0,0,0,33.12740915966256,123.56909195098791,,0,0,0,123.56909195098791
9,ILE,8.75841498872239,,0,0,0,8.75841498872239,3.819724103857254,,0,0,0,3.819724103857254,176.75506660374072,,0,0,0,176.75506660374072,64.3011347085803,,0,0,0,64.3011347085803,36.23176445322455,,0,0,0,36.23176445322455,123.98169625981797,,0,0,0,123.98169625981797
10,GLY,8.439091756421357,,0,0,0,8.439091756421357,3.8325999256299257,,0,0,0,3.8325999256299257,176.466540340898,,0,0,0,176.466540340898,47.23729026459652,,0,0,0,47.23729026459652,,,0,0,0,,107.15136116691642,,0,0,0,107.15136116691642
11,GLU,8.275157597197246,,0,0,0,8.275157597197246,3.982520037909312,,0,0,0,3.982520037909312,178.798583648002,,0,0,0,178.798583648002,59.039668370712626,,0,0,0,59.039668370712626,30.037397653374402,,0,0,0,30.037397653374402,121.97329195217006,,0,0,0,121.97329195217006
12,LEU,7.884852931490731,,0,0,0,7.884852931490731,4.212061129126429,,0,0,0,4.212061129126429,179.06806651281497,,0,0,0,179.06806651281497,57.740306670202024,,0,0,0,57.740306670202024,41.59480562085137,,0,0,0,41.59480562085137,119.68215852673993,,0,0,0,119.68215852673993
13,VAL,8.588270673809523,,0,0,0,8.588270673809523,3.563395208830059,,0,0,0,3.563395208830059,178.04437083150185,,0,0,0,178.04437083150185,66.90869737482518,,0,0,0,66.90869737482518,31.71479341789877,,0,0,0,31.71479341789877,118.718440486458,,0,0,0,118.718440486458
14,ARG,7.884936518820069,,0,0,0,7.884936518820069,4.01379873008103,,0,0,0,4.01379873008103,179.33132896321456,,0,0,0,179.33132896321456,59.22833060815296,,0,0,0,59.22833060815296,29.770790893040292,,0,0,0,29.770790893040292,120.5185035074592,,0,0,0,120.5185035074592
15,TYR,8.129116658524808,,0,0,0,8.129116658524808,4.561703282506382,,0,0,0,4.561703282506382,178.43573480432346,,0,0,0,178.43573480432346,61.09648207545232,,0,0,0,61.09648207545232,37.43915093701298,,0,0,0,37.43915093701298,120.4650043556388,,0,0,0,120.4650043556388
16,LEU,8.395031593961594,,0,0,0,8.395031593961594,3.959282978626929,,0,0,0,3.959282978626929,178.61716310127093,,0,0,0,178.61716310127093,57.700889195804194,,0,0,0,57.700889195804194,41.64409615709845,,0,0,0,41.64409615709845,119.78554442779442,,0,0,0,119.78554442779442
17,ASN,7.977009083211233,,0,0,0,7.977009083211233,4.580164940293041,,0,0,0,4.580164940293041,176.49026930717613,,0,0,0,176.49026930717613,55.29880761610057,,0,0,0,55.29880761610057,38.812333095770896,,0,0,0,38.812333095770896,115.28063671988568,,0,0,0,115.28063671988568
18,THR,7.748467254861805,,0,0,0,7.748467254861805,4.337819865312465,,0,0,0,4.337819865312465,175.3591325161283,,0,0,0,175.3591325161283,63.35825741307026,,0,0,0,63.35825741307026,70.35897754322345,,0,0,0,70.35897754322345,111.51692698261738,,0,0,0,111.51692698261738
19,ASN,8.106880933377733,,0,0,0,8.106880933377733,5.079860046636696,,0,0,0,5.079860046636696,172.97750202187257,,0,0,0,172.97750202187257,51.17303564345654,,0,0,0,51.17303564345654,37.98498532212233,,0,0,0,37.98498532212233,118.1071543533855,,0,0,0,118.1071543533855
20,PRO,,,0,0,0,,4.304896582686758,,0,0,0,4.304896582686758,177.9910684030525,,0,0,0,177.9910684030525,65.51085454897324,,0,0,0,65.51085454897324,32.142156991014545,,0,0,0,32.142156991014545,,,0,0,0,
21,VAL,7.941557606549006,,0,0,0,7.941557606549006,3.559428213383838,,0,0,0,3.559428213383838,177.3476959862027,,0,0,0,177.3476959862027,66.77648338974359,,0,0,0,66.77648338974359,31.52212388745699,,0,0,0,31.52212388745699,119.2388346976468,,0,0,0,119.2388346976468
22,GLY,7.923783958147408,,0,0,0,7.923783958147408,3.825200249508825,,0,0,0,3.825200249508825,176.20038080423467,,0,0,0,176.20038080423467,47.12061581918637,,0,0,0,47.12061581918637,,,0,0,0,,107.4104034617882,,0,0,0,107.4104034617882
23,GLY,8.394931068870019,,0,0,0,8.394931068870019,3.245280268376068,,0,0,0,3.245280268376068,175.3706157278,,0,0,0,175.3706157278,46.524507488295036,,0,0,0,46.524507488295036,,,0,0,0,,110.78861592958152,,0,0,0,110.78861592958152
24,LEU,8.74693069024309,,0,0,0,8.74693069024309,3.9283583306748806,,0,0,0,3.9283583306748806,178.91290746076146,,0,0,0,178.91290746076146,57.272397864280165,,0,0,0,57.272397864280165,41.415565932312134,,0,0,0,41.415565932312134,124.07198461464091,,0,0,0,124.07198461464091
25,LEU,8.184317868348318,,0,0,0,8.184317868348318,3.934297642740593,,0,0,0,3.934297642740593,178.7989317600455,,0,0,0,178.7989317600455,58.12416261171606,,0,0,0,58.12416261171606,41.48981961498502,,0,0,0,41.48981961498502,119.63426581964147,,0,0,0,119.63426581964147
26,GLU,8.24584747111222,,0,0,0,8.24584747111222,4.036375547918748,,0,0,0,4.036375547918748,178.72918534622045,,0,0,0,178.72918534622045,58.92111924820735,,0,0,0,58.92111924820735,29.17703740794761,,0,0,0,29.17703740794761,119.95334000336885,,0,0,0,119.95334000336885
27,TYR,8.604842257825508,,0,0,0,8.604842257825508,3.9390851799839046,,0,0,0,3.9390851799839046,177.26975134681985,,0,0,0,177.26975134681985,61.945345310439556,,0,0,0,61.945345310439556,39.03073515063825,,0,0,0,39.03073515063825,121.3136347632312,,0,0,0,121.3136347632312
28,ALA,8.564705963558664,,0,0,0,8.564705963558664,3.9112818087079586,,0,0,0,3.9112818087079586,179.3331326438728,,0,0,0,179.3331326438728,55.26240915533355,,0,0,0,55.26240915533355,18.56248006786547,,0,0,0,18.56248006786547,121.04392019903985,,0,0,0,121.04392019903985
29,ARG,8.293465341014542,,0,0,0,8.293465341014542,4.055433412448663,,0,0,0,4.055433412448663,180.31593670745366,,0,0,0,180.31593670745366,59.20057817519702,,0,0,0,59.20057817519702,30.109365306682207,,0,0,0,30.109365306682207,118.76993418071928,,0,0,0,118.76993418071928
30,SER,8.089169984704185,,0,0,0,8.089169984704185,4.215647261421911,,0,0,0,4.215647261421911,175.6507235131313,,0,0,0,175.6507235131313,61.35581600943501,,0,0,0,61.35581600943501,63.03194303978244,,0,0,0,63.03194303978244,116.20739471373072,,0,0,0,116.20739471373072
31,HIS,7.556177622477522,,0,0,0,7.556177622477522,4.3580293574647575,,0,0,0,4.3580293574647575,174.2764033557165,,0,0,0,174.2764033557165,55.742696010700406,,0,0,0,55.742696010700406,29.527252743256742,,0,0,0,29.527252743256742,118.01070689724165,,0,0,0,118.01070689724165
32,GLY,7.640297508469309,,0,0,0,7.640297508469309,3.8152503608003103,,0,0,0,3.8152503608003103,174.872055101221,,0,0,0,174.872055101221,46.1503156462926,,0,0,0,46.1503156462926,,,0,0,0,,107.46645137490843,,0,0,0,107.46645137490843
33,PHE,7.980294005849706,,0,0,0,7.980294005849706,4.859774276939727,,0,0,0,4.859774276939727,175.35483923517594,,0,0,0,175.35483923517594,56.230542721506275,,0,0,0,56.230542721506275,40.526762630225335,,0,0,0,40.526762630225335,119.94722338313353,,0,0,0,119.94722338313353
34,ALA,8.459732882567433,,0,0,0,8.459732882567433,4.406204421650572,,0,0,0,4.406204421650572,176.7260288370907,,0,0,0,176.7260288370907,52.05823034515485,,0,0,0,52.05823034515485,19.255092703385504,,0,0,0,19.255092703385504,125.0096119159063,,0,0,0,125.0096119159063
35,ALA,8.45574029058719,,0,0,0,8.45574029058719,5.1099145016594525,,0,0,0,5.1099145016594525,176.42285701403043,,0,0,0,176.42285701403043,50.75503521864247,,0,0,0,50.75503521864247,20.637255864152515,,0,0,0,20.637255864152515,125.1155493050394,,0,0,0,125.1155493050394
36,GLU,8.698157546914198,,0,0,0,8.698157546914198,4.560452764746365,,0,0,0,4.560452764746365,174.33896655714284,,0,0,0,174.33896655714284,54.49009285430126,,0,0,0,54.49009285430126,33.08780577560773,,0,0,0,33.08780577560773,120.86008355752026,,0,0,0,120.86008355752026
37,PHE,8.827561354340105,,0,0,0,8.827561354340105,5.422410944122545,,0,0,0,5.422410944122545,175.45957902820513,,0,0,0,175.45957902820513,56.43293782347653,,0,0,0,56.43293782347653,40.96897725031635,,0,0,0,40.96897725031635,121.84277602697857,,0,0,0,121.84277602697857
38,LYS,9.228446037862138,,0,0,0,9.228446037862138,4.874254874786325,,0,0,0,4.874254874786325,175.05222751002884,,0,0,0,175.05222751002884,54.48092728159618,,0,0,0,54.48092728159618,35.4974371986791,,0,0,0,35.4974371986791,124.44898722719503,,0,0,0,124.44898722719503
39,LEU,8.854732487590187,,0,0,0,8.854732487590187,3.7646550002442,,0,0,0,3.7646550002442,176.44163004994448,,0,0,0,176.44163004994448,55.53396560902431,,0,0,0,55.53396560902431,41.8817336009768,,0,0,0,41.8817336009768,126.9378384082251,,0,0,0,126.9378384082251
40,VAL,8.916467941852591,,0,0,0,8.916467941852591,3.9377369571706065,,0,0,0,3.9377369571706065,175.7590020835165,,0,0,0,175.7590020835165,63.342746316400266,,0,0,0,63.342746316400266,32.73347540435675,,0,0,0,32.73347540435675,128.83774796189365,,0,0,0,128.83774796189365
41,ASP,7.743097887001887,,0,0,0,7.743097887001887,4.813130199816849,,0,0,0,4.813130199816849,174.22562845485072,,0,0,0,174.22562845485072,53.66438587576313,,0,0,0,53.66438587576313,44.23934476273726,,0,0,0,44.23934476273726,118.22355181826508,,0,0,0,118.22355181826508
42,GLN,8.551530864779664,,0,0,0,8.551530864779664,5.081408221556221,,0,0,0,5.081408221556221,174.3438119520313,,0,0,0,174.3438119520313,54.81011838760684,,0,0,0,54.81011838760684,30.943401003507603,,0,0,0,30.943401003507603,122.43256582939283,,0,0,0,122.43256582939283
43,SER,8.853134673193473,,0,0,0,8.853134673193473,4.708048856149406,,0,0,0,4.708048856149406,173.7671798962038,,0,0,0,173.7671798962038,57.17840622273282,,0,0,0,57.17840622273282,65.36044173843933,,0,0,0,65.36044173843933,121.17613164727494,,0,0,0,121.17613164727494
44,GLY,8.332949421811522,,0,0,0,8.332949421811522,4.173998506487957,,0,0,0,4.173998506487957,173.82509592907093,,0,0,0,173.82509592907093,44.43153666944722,,0,0,0,44.43153666944722,,,0,0,0,,109.80332321557331,,0,0,0,109.80332321557331
45,PRO,,,0,0,0,,4.651116526628927,,0,0,0,4.651116526628927,171.59859017320457,,0,0,0,171.59859017320457,61.291436923004774,,0,0,0,61.291436923004774,31.152571745676543,,0,0,0,31.152571745676543,,,0,0,0,
46,PRO,,,0,0,0,,4.278562458111334,,0,0,0,4.278562458111334,177.20098443447108,,0,0,0,177.20098443447108,64.78411998247863,,0,0,0,64.78411998247863,31.743310579792432,,0,0,0,31.743310579792432,,,0,0,0,
47,HIS,8.312330663164612,,0,0,0,8.312330663164612,4.653943637701189,,0,0,0,4.653943637701189,174.9703403444722,,0,0,0,174.9703403444722,56.15994016334221,,0,0,0,56.15994016334221,29.481039042246643,,0,0,0,29.481039042246643,114.17965218505938,,0,0,0,114.17965218505938
48,GLU,7.802267632667332,,0,0,0,7.802267632667332,4.61283853506216,,0,0,0,4.61283853506216,174.78208134877346,,0,0,0,174.78208134877346,54.087452676229326,,0,0,0,54.087452676229326,29.92905121202131,,0,0,0,29.92905121202131,120.8013590912865,,0,0,0,120.8013590912865
49,PRO,,,0,0,0,,4.314730047430347,,0,0,0,4.314730047430347,175.15396890140417,,0,0,0,175.15396890140417,63.07395732108447,,0,0,0,63.07395732108447,32.04461900839716,,0,0,0,32.04461900839716,,,0,0,0,
50,LYS,8.419279201659451,,0,0,0,8.419279201659451,4.995476713547563,,0,0,0,4.995476713547563,174.92585205539459,,0,0,0,174.92585205539459,54.898653104767455,,0,0,0,54.898653104767455,34.714245863558666,,0,0,0,34.714245863558666,122.8772805026973,,0,0,0,122.8772805026973
51,PHE,9.531609639921191,,0,0,0,9.531609639921191,5.060196160106559,,0,0,0,5.060196160106559,175.29716519805194,,0,0,0,175.29716519805194,56.82255775699301,,0,0,0,56.82255775699301,40.6424761488567,,0,0,0,40.6424761488567,125.96688382104563,,0,0,0,125.96688382104563
52,VAL,8.999329833810634,,0,0,0,8.999329833810634,5.044822749023199,,0,0,0,5.044822749023199,175.4765129780553,,0,0,0,175.4765129780553,61.5988541530969,,0,0,0,61.5988541530969,31.91876383090798,,0,0,0,31.91876383090798,124.73289589958375,,0,0,0,124.73289589958375
53,TYR,9.314244406110555,,0,0,0,9.314244406110555,5.1432610956543465,,0,0,0,5.1432610956543465,174.80874615999556,,0,0,0,174.80874615999556,56.63019950218115,,0,0,0,56.63019950218115,41.83998147545787,,0,0,0,41.83998147545787,128.27120810341881,,0,0,0,128.27120810341881
54,GLN,9.194211741519592,,0,0,0,9.194211741519592,5.104734502331003,,0,0,0,5.104734502331003,174.84037253042513,,0,0,0,174.84037253042513,54.20846911010656,,0,0,0,54.20846911010656,32.868728953868356,,0,0,0,32.868728953868356,122.04423425333,,0,0,0,122.04423425333
55,ALA,9.045344517671216,,0,0,0,9.045344517671216,5.194235231679432,,0,0,0,5.194235231679432,175.5977006438728,,0,0,0,175.5977006438728,50.653501836280384,,0,0,0,50.653501836280384,21.516057709657012,,0,0,0,21.516057709657012,127.73355156898657,,0,0,0,127.73355156898657
56,LYS,8.764683245526696,,0,0,0,8.764683245526696,5.037425784981685,,0,0,0,5.037425784981685,175.209130566872,,0,0,0,175.209130566872,54.543524010955714,,0,0,0,54.543524010955714,34.50372477370963,,0,0,0,34.50372477370963,122.30663932570764,,0,0,0,122.30663932570764
57,VAL,9.140076017471419,,0,0,0,9.140076017471419,4.7871136479797975,,0,0,0,4.7871136479797975,176.82959127500834,,0,0,0,176.82959127500834,60.75931172091797,,0,0,0,60.75931172091797,34.31861881776002,,0,0,0,34.31861881776002,126.56219526830392,,0,0,0,126.56219526830392
58,GLY,9.525463106493506,,0,0,0,9.525463106493506,3.5092854983877233,,0,0,0,3.5092854983877233,174.6434007612998,,0,0,0,174.6434007612998,46.694213472804975,,0,0,0,46.694213472804975,,,0,0,0,,118.20823641227106,,0,0,0,118.20823641227106
59,GLY,8.377163552430902,,0,0,0,8.377163552430902,3.6456535265623264,,0,0,0,3.6456535265623264,173.64170864322344,,0,0,0,173.64170864322344,45.207658295865244,,0,0,0,45.207658295865244,,,0,0,0,,107.94704522760573,,0,0,0,107.94704522760573
60,ARG,7.714868576118327,,0,0,0,7.714868576118327,4.506677871189921,,0,0,0,4.506677871189921,174.70253633770676,,0,0,0,174.70253633770676,54.77715828957709,,0,0,0,54.77715828957709,31.977582764468863,,0,0,0,31.977582764468863,121.37366450985681,,0,0,0,121.37366450985681
61,TRP,8.815159622843824,,0,0,0,8.815159622843824,5.021594437545788,,0,0,0,5.021594437545788,176.1704376227883,,0,0,0,176.1704376227883,57.0751424023199,,0,0,0,57.0751424023199,30.25885312943168,,0,0,0,30.25885312943168,126.45576627276613,,0,0,0,126.45576627276613
62,PHE,9.126095031773783,,0,0,0,9.126095031773783,4.817319818914419,,0,0,0,4.817319818914419,173.61986283468198,,0,0,0,173.61986283468198,54.68757251680542,,0,0,0,54.68757251680542,41.068928102664,,0,0,0,41.068928102664,122.43290488075259,,0,0,0,122.43290488075259
63,PRO,,,0,0,0,,4.564737531024531,,0,0,0,4.564737531024531,175.71519925249197,,0,0,0,175.71519925249197,63.40976338158508,,0,0,0,63.40976338158508,32.37091210385726,,0,0,0,32.37091210385726,,,0,0,0,
64,ALA,8.445937565046066,,0,0,0,8.445937565046066,4.9960177271839274,,0,0,0,4.9960177271839274,177.5166179364691,,0,0,0,177.5166179364691,51.951535432256634,,0,0,0,51.951535432256634,19.343879273670776,,0,0,0,19.343879273670776,126.0811263037962,,0,0,0,126.0811263037962
65,VAL,9.076537044838496,,0,0,0,9.076537044838496,4.709381493584193,,0,0,0,4.709381493584193,174.4956556371462,,0,0,0,174.4956556371462,59.9281268458819,,0,0,0,59.9281268458819,34.794805343695195,,0,0,0,34.794805343695195,117.70951628644134,,0,0,0,117.70951628644134
66,CYS,8.770099764058164,,0,0,0,8.770099764058164,5.253727652164502,,0,0,0,5.253727652164502,174.03583308195692,,0,0,0,174.03583308195692,57.15919535907426,,0,0,0,57.15919535907426,28.689257803524253,,0,0,0,28.689257803524253,121.99815527333777,,0,0,0,121.99815527333777
67,ALA,8.983539767732267,,0,0,0,8.983539767732267,4.829983275380176,,0,0,0,4.829983275380176,176.45459654296815,,0,0,0,176.45459654296815,50.69198019232989,,0,0,0,50.69198019232989,22.84881807009657,,0,0,0,22.84881807009657,126.58565577071262,,0,0,0,126.58565577071262
68,HIS,9.03081353977134,,0,0,0,9.03081353977134,5.127777673398823,,0,0,0,5.127777673398823,174.81808268105783,,0,0,0,174.81808268105783,56.95668748953824,,0,0,0,56.95668748953824,30.16434687080142,,0,0,0,30.16434687080142,116.73833462886003,,0,0,0,116.73833462886003
69,SER,7.50691760975691,,0,0,0,7.50691760975691,4.115715567854368,,0,0,0,4.115715567854368,174.31972674418913,,0,0,0,174.31972674418913,57.0811326560606,,0,0,0,57.0811326560606,65.44564369926185,,0,0,0,65.44564369926185,112.59985062680653,,0,0,0,112.59985062680653
70,LYS,8.760482144705295,,0,0,0,8.760482144705295,3.694476703188478,,0,0,0,3.694476703188478,178.42545059181373,,0,0,0,178.42545059181373,59.632998725874124,,0,0,0,59.632998725874124,32.17650895546676,,0,0,0,32.17650895546676,123.82754808409369,,0,0,0,123.82754808409369
71,LYS,8.000753646092795,,0,0,0,8.000753646092795,3.8549898105477856,,0,0,0,3.8549898105477856,178.41970591766565,,0,0,0,178.41970591766565,59.238772025224776,,0,0,0,59.238772025224776,31.99334081860917,,0,0,0,31.99334081860917,119.09002318187923,,0,0,0,119.09002318187923
72,GLN,7.679209460778111,,0,0,0,7.679209460778111,4.067714246894772,,0,0,0,4.067714246894772,178.05300376981907,,0,0,0,178.05300376981907,58.27650380320236,,0,0,0,58.27650380320236,28.729329628610277,,0,0,0,28.729329628610277,119.13220081808747,,0,0,0,119.13220081808747
73,GLY,8.610592335508935,,0,0,0,8.610592335508935,3.6419437057581314,,0,0,0,3.6419437057581314,175.78949755475637,,0,0,0,175.78949755475637,47.302323369275165,,0,0,0,47.302323369275165,,,0,0,0,,107.6415160105228,,0,0,0,107.6415160105228
74,LYS,7.522836694882894,,0,0,0,7.522836694882894,3.599186301864802,,0,0,0,3.599186301864802,178.52635381501275,,0,0,0,178.52635381501275,59.4558671969808,,0,0,0,59.4558671969808,32.33898113772339,,0,0,0,32.33898113772339,121.52530757198357,,0,0,0,121.52530757198357
75,GLN,7.838886531324231,,0,0,0,7.838886531324231,3.8939723245698747,,0,0,0,3.8939723245698747,178.21823836707736,,0,0,0,178.21823836707736,59.06540414624265,,0,0,0,59.06540414624265,28.64397031829837,,0,0,0,28.64397031829837,118.95899413764569,,0,0,0,118.95899413764569
76,GLU,8.418636048434898,,0,0,0,8.418636048434898,4.111937909620934,,0,0,0,4.111937909620934,179.2414711187701,,0,0,0,179.2414711187701,58.88992021604506,,0,0,0,58.88992021604506,29.198840416761016,,0,0,0,29.198840416761016,119.50768311195472,,0,0,0,119.50768311195472
77,ALA,8.353625743833945,,0,0,0,8.353625743833945,4.2063619514319015,,0,0,0,4.2063619514319015,179.20655534504385,,0,0,0,179.20655534504385,55.4707351493118,,0,0,0,55.4707351493118,18.456146771411923,,0,0,0,18.456146771411923,122.92342967102341,,0,0,0,122.92342967102341
78,ALA,8.549285352625153,,0,0,0,8.549285352625153,4.053272329587079,,0,0,0,4.053272329587079,178.90290270374626,,0,0,0,178.90290270374626,55.29810290599401,,0,0,0,55.29810290599401,18.59585445077145,,0,0,0,18.59585445077145,120.40164833383838,,0,0,0,120.40164833383838
79,ASP,8.926433347846597,,0,0,0,8.926433347846597,4.3205446228826725,,0,0,0,4.3205446228826725,178.15627725271952,,0,0,0,178.15627725271952,58.28280561957487,,0,0,0,58.28280561957487,42.682213085209234,,0,0,0,42.682213085209234,120.296261251998,,0,0,0,120.296261251998
80,ALA,8.299206431546231,,0,0,0,8.299206431546231,4.115514040864691,,0,0,0,4.115514040864691,180.18898072867688,,0,0,0,180.18898072867688,55.04777224008214,,0,0,0,55.04777224008214,18.342694533283385,,0,0,0,18.342694533283385,121.0886419471584,,0,0,0,121.0886419471584
81,ALA,8.161850073865024,,0,0,0,8.161850073865024,4.041374803707404,,0,0,0,4.041374803707404,179.05119370738151,,0,0,0,179.05119370738151,54.84254059769675,,0,0,0,54.84254059769675,18.26709242875458,,0,0,0,18.26709242875458,121.88847625191475,,0,0,0,121.88847625191475
82,LEU,8.635224657248306,,0,0,0,8.635224657248306,3.7886300880286377,,0,0,0,3.7886300880286377,178.86951693951605,,0,0,0,178.86951693951605,58.02155094588189,,0,0,0,58.02155094588189,41.56424127093462,,0,0,0,41.56424127093462,118.49174939069819,,0,0,0,118.49174939069819
83,ARG,8.231551215373516,,0,0,0,8.231551215373516,3.988961256826507,,0,0,0,3.988961256826507,179.1134905870019,,0,0,0,179.1134905870019,59.830533557992005,,0,0,0,59.830533557992005,30.098528947363747,,0,0,0,30.098528947363747,119.16232424007104,,0,0,0,119.16232424007104
84,VAL,7.952396015412365,,0,0,0,7.952396015412365,3.6558192763486512,,0,0,0,3.6558192763486512,178.21338489111446,,0,0,0,178.21338489111446,66.52523793302254,,0,0,0,66.52523793302254,31.583478423903873,,0,0,0,31.583478423903873,120.83053428212898,,0,0,0,120.83053428212898
85,LEU,8.222984663419913,,0,0,0,8.222984663419913,3.9962201461704963,,0,0,0,3.9962201461704963,179.45637176748252,,0,0,0,179.45637176748252,58.19619352994228,,0,0,0,58.19619352994228,41.64746990205905,,0,0,0,41.64746990205905,120.41073488739039,,0,0,0,120.41073488739039
86,ILE,8.539234938622489,,0,0,0,8.539234938622489,3.4431344795371315,,0,0,0,3.4431344795371315,177.75655152231658,,0,0,0,177.75655152231658,65.99558625824731,,0,0,0,65.99558625824731,38.11414169075369,,0,0,0,38.11414169075369,120.17551907434233,,0,0,0,120.17551907434233
87,GLY,8.405965844449995,,0,0,0,8.405965844449995,3.9120937624292376,,0,0,0,3.9120937624292376,176.3528672483905,,0,0,0,176.3528672483905,47.24375144636475,,0,0,0,47.24375144636475,,,0,0,0,,107.87730599456654,,0,0,0,107.87730599456654
88,GLU,8.469927958480408,,0,0,0,8.469927958480408,4.126274856110556,,0,0,0,4.126274856110556,178.92394577705073,,0,0,0,178.92394577705073,58.72989832034632,,0,0,0,58.72989832034632,29.304029923187922,,0,0,0,29.304029923187922,121.59772922152847,,0,0,0,121.59772922152847
89,ASN,8.327203376540126,,0,0,0,8.327203376540126,4.523777809296259,,0,0,0,4.523777809296259,177.2226125071928,,0,0,0,177.2226125071928,55.84045663744589,,0,0,0,55.84045663744589,39.61375195375735,,0,0,0,39.61375195375735,119.96968633361084,,0,0,0,119.96968633361084
90,GLU,8.355866878116329,,0,0,0,8.355866878116329,4.037641008680208,,0,0,0,4.037641008680208,178.77520429559328,,0,0,0,178.77520429559328,58.9320065503885,,0,0,0,58.9320065503885,29.50677812170607,,0,0,0,29.50677812170607,119.13403281324787,,0,0,0,119.13403281324787